{"text_format":"1","workbook":"xlsx","n_sheets":7,"sheets":["WPS Quote","WPS Tables","WPS Rating Factors","WPS Health Plan Quote","WPS Health Plan Tables","WPS Health Plan Rating Factors","WPS Health Plan Subsidy Calcs"],"not_rendered":{"charts":0,"images":2,"macros":1,"external_links":0,"defined_names":4,"comments":1,"pivot_tables":0},"unopened":[],"bounds":{"document_bytes":16777216,"sheet_cells":100000,"rows_first":2000,"rows_last":500,"rows_between":2000,"halvings":0,"cell_chars":16384,"cell_head_chars":4096},"cells_cut":0,"cells_raw":0,"read":"whole","date_system":"1900"}

{"sheet":"WPS Quote","index":0,"n_rows":65,"n_cols":19,"rows_kept":65,"cut":false,"hidden":false,"merged":[[88,1,88,14],[43,1,43,3],[43,12,43,13],[44,1,44,3],[44,12,44,13],[50,14,52,14],[53,1,53,3],[53,12,53,13],[54,1,54,3],[54,12,54,13],[50,4,52,5],[54,4,54,5],[54,6,54,7],[54,8,54,11],[51,1,51,3],[52,1,52,3],[12,1,13,14],[17,3,17,4],[31,7,33,7],[31,8,31,11],[31,12,31,13],[31,14,33,14],[32,9,33,9],[32,10,33,10],[32,12,32,13],[33,12,33,13],[31,1,31,3],[32,1,32,3],[33,1,33,3],[34,1,34,3],[34,12,34,13],[35,1,35,3],[35,12,35,13],[50,6,52,7],[50,8,52,11],[50,12,52,13],[37,1,37,3],[37,12,37,13],[38,12,38,13],[39,1,39,3],[39,12,39,13],[40,12,40,13],[41,1,41,3],[41,12,41,13],[50,1,50,3]]}
[null,null,null,null,null,null,null,null,null,null,null,null,null,"Quote Date: ",{"$f":"TODAY()","v":"2021-10-26"}]
[null,null,null,null,null,null,null,null,null,null,null,null,null,"Valid Through: ","2022-12-31"]
[]
[]
[]
[]
{"$rows_left_out":60}
{"sheet":"WPS Tables","index":1,"n_rows":28,"n_cols":15,"rows_kept":28,"cut":false,"hidden":true,"merged":[[3,1,3,2],[3,5,3,6],[3,8,3,9],[9,5,9,6],[9,8,9,9]]}
[]
[]
[null,null,null,null,null,null,null,null,null,null,null,null,null,"NOTE: These plan names are supposed to have \"| Statewide Network\" at the end, but do to size constraints, im leaving that off and putting it in the title of the categorey"]
[null,"WPS County Selection",null,null,null,"Spouse Selection",null,null,"App. Tobacco",null,null,null,null,"WPS PPO Bronze $6,500 with 3 Free PCP Visits","https://www.wpshealth.com/resources/sbc/files/2022/81974WI1880048-00.pdf"]
[null,null,null,null,null,"Indicator",{"$f":"IF('WPS Quote'!D20=G6,1,IF('WPS Quote'!D20=G7,2,3))","v":1},null,"Indicator",{"$f":"IF('WPS Quote'!E28=J6,1,IF('WPS Quote'!E28=J7,2,3))","v":1},null,null,null,"WPS PPO Bronze $8,700","https://www.wpshealth.com/resources/sbc/files/2022/81974WI1880030-00.pdf"]
[null,"Ashland",2,null,null,1,null,null,1,null,null,null,null,"WPS PPO Catastrophic $8,700 with 3 Free PCP Visits","https://www.wpshealth.com/resources/sbc/files/2022/81974WI1880044-00.pdf"]
{"$rows_left_out":23}
{"sheet":"WPS Rating Factors","index":2,"n_rows":93,"n_cols":117,"rows_kept":93,"cut":false,"hidden":true,"merged":[[5,56,5,66],[5,67,5,77],[5,78,5,88],[32,98,32,99],[33,98,33,99]]}
[null,null,null,null,null,null,null,null,null,null,null,null,null,null,null,null,null,null,null,null,null,null,null,null,null,null,null,null,null,null,null,null,null,null,null,null,null,null,null,null,null,null,null,null,null,null,null,null,null,null,null,null,null,null,null,null,null,null,null,null,null,null,null,null,null,null,null,null,null,null,null,null,null,null,null,null,null,null,null,null,null,null,null,null,null,null,null,null,null,null,null,null,null,null,null,"Eff. Date",{"$f":"'WPS Quote'!I18","v":"00:00:00"}]
[null,null,null,null,null,null,null,null,null,null,null,null,null,null,null,null,null,null,null,null,null,null,null,null,null,null,null,null,null,null,null,null,null,null,null,null,null,null,null,null,null,null,null,null,null,null,null,null,null,null,null,null,null,null,null,null,null,null,null,null,null,null,null,null,null,null,null,null,null,null,null,null,null,null,null,null,null,null,null,null,null,null,null,null,null,null,null,null,null,null,null,null,"the formula starting in",null,null,"Rate Calc Date"]
[null,null,null,null,null,null,null,null,null,null,null,null,null,null,null,null,null,null,null,null,null,null,null,null,null,null,null,null,null,null,null,null,null,null,null,null,null,null,null,null,null,null,null,null,null,null,null,null,null,null,null,null,null,null,null,null,null,null,null,null,null,null,null,null,null,null,null,null,null,null,null,null,null,null,null,null,null,null,null,null,null,null,null,null,null,null,null,null,null,null,null,null,"row 2 column CS used to"]
[null,null,null,null,null,null,null,null,"On/Off",null,null,null,null,null,null,null,null,null,null,null,null,null,null,null,null,null,null,null,null,null,null,null,null,null,null,null,null,null,null,null,null,null,null,null,null,null,null,null,null,null,null,null,null,null,null,null,null,null,null,null,null,null,null,null,null,null,null,null,null,null,null,null,null,null,null,null,null,null,null,null,null,null,null,null,null,null,null,null,null,null,null,null,"be for plan changes, no ",null,null,"Member","Applicant","Spouse","Dep. 1","Dep. 2","Dep. 3","Dep. 4","Dep. 5","Dep. 6","Dep. 7","Dep. 8","Dep. 9","Dep. 10",null,null,null,null,null,"TOTAL"]
[null,null,null,null,null,null,null,"PPO",{"$f":"VLOOKUP('WPS Quote'!I20,'WPS Tables'!$B$6:$C$28,2,FALSE)","v":{"$error":"#N/A"}},null,null,null,null,null,null,null,null,null,null,"Original",null,null,null,null,null,null,null,null,null,null,null,null,null,null,null,null,null,null,null,null,null,null,null,null,null,null,null,null,null,null,null,null,null,null,null,null,null,null,null,null,null,null,null,null,null,null,null,null,null,null,null,null,null,null,null,null,null,null,null,null,null,null,null,null,null,null,null,null,null,null,null,null,"longer needed since",null,null,"DOB",{"$f":"IF('WPS Quote'!C28=\"\",\"\",'WPS Quote'!C28)","v":""},{"$f":"IF('WPS Quote'!C30=\"\",\"\",'WPS Quote'!C30)","v":""},{"$f":"IF('WPS Quote'!G28=\"\",\"\",'WPS Quote'!G28)","v":""},{"$f":"IF('WPS Quote'!G30=\"\",\"\",'WPS Quote'!G30)","v":""},{"$f":"IF('WPS Quote'!I28=\"\",\"\",'WPS Quote'!I28)","v":""},{"$f":"IF('WPS Quote'!I30=\"\",\"\",'WPS Quote'!I30)","v":""},{"$f":"IF('WPS Quote'!L28=\"\",\"\",'WPS Quote'!L28)","v":""},{"$f":"IF('WPS Quote'!L30=\"\",\"\",'WPS Quote'!L30)","v":""},{"$f":"IF('WPS Quote'!N28=\"\",\"\",'WPS Quote'!N28)","v":""},{"$f":"IF('WPS Quote'!N30=\"\",\"\",'WPS Quote'!N30)","v":""},{"$f":"IF('WPS Quote'!T28=\"\",\"\",'WPS Quote'!T28)","v":""},{"$f":"IF('WPS Quote'!T30=\"\",\"\",'WPS Quote'!T30)","v":""},null,null,null,null,null,null,null,null,"Value of the"]
[null,null,null,"Age","Tobacco",null,null,"HDHP",2,null,null,null,null,null,null,"PPO",1,null,null,"Plan Order",null,null,null,"Aspirus Arise","ThedaCare","ThedaCare","ThedaCare","Aurora","Aurora","Aurora","Aurora","Aurora","Aurora","Aurora","Aurora","Aurora","Aurora","Aurora","Aurora",null,null,null,null,null,null,null,null,"Retail","PCP","SPC","ER",null,null,"POS",null,null,"Poverty Level 101-150",null,null,null,null,null,null,null,null,null,null,"Poverty Level 151%-200%",null,null,null,null,null,null,null,null,null,null,"Poverty Level 201%-250%",null,null,null,null,null,null,null,null,null,null,null,null,null,"facets rates",null,null,"Age",{"$f":"IF(MONTH(IF(CS2=\"\",$CS$1,CS2))<MONTH(CS5),YEAR(IF(CS2=\"\",$CS$1,CS2))-YEAR(CS5)-1,IF(MONTH(IF(CS2=\"\",$CS$1,CS2))>MONTH(CS5),YEAR(IF(CS2=\"\",$CS$1,CS2))-YEAR(CS5),IF(DAY(IF(CS2=\"\",$CS$1,CS2))<DAY(CS5),YEAR(IF(CS2=\"\",$CS$1,CS2))-YEAR(CS5)-1,YEAR(IF(CS2=\"\",$CS$1,CS2))-YEAR(CS5))))","v":{"$error":"#VALUE!"}},{"$error":"#VALUE!"},{"$error":"#VALUE!"},{"$error":"#VALUE!"},{"$error":"#VALUE!"},{"$error":"#VALUE!"},{"$error":"#VALUE!"},{"$error":"#VALUE!"},{"$error":"#VALUE!"},{"$error":"#VALUE!"},{"$error":"#VALUE!"},{"$error":"#VALUE!"},null,null,null,null,null,null,null,"For Subsidy Calculator","Smoker Surcharge"]
{"$rows_left_out":88}
{"sheet":"WPS Health Plan Quote","index":3,"n_rows":87,"n_cols":18,"rows_kept":87,"cut":false,"hidden":false,"merged":[[70,4,70,5],[70,6,70,7],[70,8,70,11],[69,12,69,13],[67,12,67,14],[70,12,70,14],[68,12,68,14],[67,1,67,3],[66,1,66,3],[68,1,68,3],[69,1,69,3],[70,1,70,3],[59,12,59,14],[60,12,60,14],[62,12,62,14],[66,4,68,5],[66,6,68,7],[66,8,68,11],[66,12,66,14],[57,12,57,14],[58,12,58,14],[45,12,45,14],[47,12,47,14],[49,12,49,14],[51,12,51,14],[55,12,55,14],[53,12,53,14],[105,1,105,15],[44,1,44,3],[26,12,26,14],[27,12,27,14],[28,12,28,14],[31,12,31,14],[29,12,29,14],[33,12,33,14],[60,1,60,3],[62,1,62,3],[57,7,59,7],[57,8,57,11],[57,15,59,15],[58,9,59,9],[58,10,59,10],[66,15,68,15],[39,12,39,14],[41,12,41,14],[43,12,43,14],[41,1,41,3],[43,1,43,3],[39,1,39,3],[8,1,8,15],[4,17,5,18],[45,1,45,3],[26,7,28,7],[26,8,26,11],[26,15,28,15],[27,9,28,9],[27,10,28,10],[29,1,29,3],[31,1,31,3],[33,1,33,3],[35,1,35,3],[37,1,37,3],[35,12,35,14],[26,1,26,3],[37,12,37,14],[27,1,27,3],[28,1,28,3],[57,1,57,3],[58,1,58,3],[59,1,59,3],[47,1,47,3],[49,1,49,3],[51,1,51,3],[53,1,53,3],[55,1,55,3]]}
[null,null,null,null,null,null,null,null,null,null,null,null,null,null,"Quote Date: ",{"$f":"TODAY()","v":"2021-10-26"}]
[null,null,null,null,null,null,null,null,null,null,null,null,null,null,"Valid Through: ","2022-12-31"]
[]
[]
[null,null,null,null,null,null,null,null,null,null,null,null,null,null,null,null,null,{"$f":"IF('WPS Health Plan Quote'!L15=\"Off Exchange\",HYPERLINK('WPS Health Plan Tables'!O2,\"Enroll Now\"),IF('WPS Health Plan Quote'!L15=\"On Exchange\",HYPERLINK('WPS Health Plan Tables'!O1,\"Enroll Now\"),\"\"))","v":""}]
[]
{"$rows_left_out":82}
{"sheet":"WPS Health Plan Tables","index":4,"n_rows":85,"n_cols":116,"rows_kept":85,"cut":false,"hidden":true,"merged":[[3,1,3,2],[3,5,3,6],[3,8,3,9],[9,5,9,6],[9,8,9,9]]}
[null,null,null,null,null,null,null,null,null,null,null,null,null,"On Exchange Link","https://wps.healthsherpa.com/?_agent_id=wps"]
[null,null,null,null,null,null,null,null,null,null,null,null,null,"Off Exchange Link","https://my.wpshealth.com/en/Individual/healthplanhome?WebsiteId=ahsnpwa&state=pjn2yxr&producttype=tvewa9w "]
[null,null,null,null,null,null,null,null,null,null,null,null,null,"NOTE: These plan names are supposed to have \"| Select Network\" at the end, but do to size constraints, im leaving that off and putting it in the title of the categorey"]
[null,"County Selection",null,null,null,"Spouse Selection",null,null,"App. Tobacco",null,null,null,null,"WPS HMO Bronze $6,500 with 3 Free PCP Visits","https://www.wpshealth.com/resources/sbc/files/2022/84670WI1250150-00.pdf"]
[null,null,null,null,null,"Indicator",{"$f":"IF('WPS Health Plan Quote'!D15=G6,1,IF('WPS Health Plan Quote'!D15=G7,2,3))","v":1},null,"Indicator",{"$f":"IF('WPS Health Plan Quote'!E23=J6,1,IF(#REF!=J7,2,3))","v":1},null,null,null,"WPS HMO Bronze $6,500 with 3 Free PCP Visits","https://www.wpshealth.com/resources/sbc/files/2022/84670WI1250150-01.pdf"]
[null,"Brown",2,null,null,1,null,null,1,null,null,null,null,"WPS HMO Bronze $0 CSR Zero","https://www.wpshealth.com/resources/sbc/files/2022/84670WI1250150-02.pdf"]
{"$rows_left_out":80}
{"sheet":"WPS Health Plan Rating Factors","index":5,"n_rows":113,"n_cols":117,"rows_kept":113,"cut":false,"hidden":true,"merged":[[5,56,5,66],[5,67,5,77],[5,78,5,88]]}
[null,null,null,null,null,null,null,null,null,null,null,null,null,null,null,null,null,null,null,null,null,null,null,null,null,null,null,null,null,null,null,null,null,null,null,null,null,null,null,null,null,null,null,null,null,null,null,null,null,null,null,null,null,null,null,null,null,null,null,null,null,null,null,null,null,null,null,null,null,null,null,null,null,null,null,null,null,null,null,null,null,null,null,null,null,null,null,null,null,null,null,null,null,null,null,"Eff. Date",{"$f":"'WPS Health Plan Quote'!H13","v":"00:00:00"}]
[null,null,null,null,null,null,null,null,null,null,null,null,null,null,null,null,null,null,null,null,null,null,null,null,null,null,null,null,null,null,null,null,null,null,null,null,null,null,null,null,null,null,null,null,null,null,null,null,null,null,null,null,null,null,null,null,null,null,null,null,null,null,null,null,null,null,null,null,null,null,null,null,null,null,null,null,null,null,null,null,null,null,null,null,null,null,null,null,null,null,null,null,null,null,null,"Rate Calc Date"]
[]
[null,null,null,null,null,null,null,null,"On/Off",null,null,null,null,null,null,null,null,null,null,null,null,null,null,null,null,null,null,null,null,null,null,null,null,null,null,null,null,null,null,null,null,null,null,null,null,null,null,null,null,null,null,null,null,null,null,null,null,null,null,null,null,null,null,null,null,null,null,null,null,null,null,null,null,null,null,null,null,null,null,null,null,null,null,null,null,null,null,null,null,null,null,null,null,null,null,"Member","Applicant","Spouse","Dep. 1","Dep. 2","Dep. 3","Dep. 4","Dep. 5","Dep. 6","Dep. 7","Dep. 8","Dep. 9","Dep. 10",null,null,null,null,null,"TOTAL"]
[null,null,null,null,null,null,null,"PPO",{"$f":"VLOOKUP('WPS Health Plan Quote'!L13,'WPS Health Plan Tables'!$B$5:$C$27,2,FALSE)","v":{"$error":"#N/A"}},null,null,null,null,null,null,null,null,null,null,"Original",null,null,null,null,null,null,null,null,null,null,null,null,null,null,null,null,null,null,null,null,null,null,null,null,null,null,null,null,null,null,null,null,null,null,null,null,null,null,null,null,null,null,null,null,null,null,null,null,null,null,null,null,null,null,null,null,null,null,null,null,null,null,null,null,null,null,null,null,null,null,null,null,null,null,null,"DOB",{"$f":"IF('WPS Health Plan Quote'!C23=\"\",\"\",'WPS Health Plan Quote'!C23)","v":""},{"$f":"IF('WPS Health Plan Quote'!C25=\"\",\"\",'WPS Health Plan Quote'!C25)","v":""},{"$f":"IF('WPS Health Plan Quote'!G23=\"\",\"\",'WPS Health Plan Quote'!G23)","v":""},{"$f":"IF('WPS Health Plan Quote'!G25=\"\",\"\",'WPS Health Plan Quote'!G25)","v":""},{"$f":"IF('WPS Health Plan Quote'!I23=\"\",\"\",'WPS Health Plan Quote'!I23)","v":""},{"$f":"IF('WPS Health Plan Quote'!I25=\"\",\"\",'WPS Health Plan Quote'!I25)","v":""},{"$f":"IF('WPS Health Plan Quote'!L23=\"\",\"\",'WPS Health Plan Quote'!L23)","v":""},{"$f":"IF('WPS Health Plan Quote'!L25=\"\",\"\",'WPS Health Plan Quote'!L25)","v":""},{"$f":"IF('WPS Health Plan Quote'!N23=\"\",\"\",'WPS Health Plan Quote'!N23)","v":""},{"$f":"IF('WPS Health Plan Quote'!N25=\"\",\"\",'WPS Health Plan Quote'!N25)","v":""},{"$f":"IF('WPS Health Plan Rating Factors'!DD39=\"\",\"\",'WPS Health Plan Rating Factors'!DD39)","v":""},{"$f":"IF('WPS Health Plan Rating Factors'!DD41=\"\",\"\",'WPS Health Plan Rating Factors'!DD41)","v":""},null,null,null,null,null,null,null,null,"Value of the"]
[null,null,null,"Age","Tobacco",null,null,"HDHP",2,null,null,null,null,null,null,"PPO",1,null,null,"Plan Order",null,"Aspirus Arise","Aspirus Arise","Aspirus Arise","ThedaCare","ThedaCare","ThedaCare","Aurora","Aurora","Aurora","Aurora","Aurora","Aurora","Aurora","Aurora","Aurora","Aurora","Aurora","Aurora",null,null,null,null,null,null,null,null,"Retail","PCP","SPC","ER",null,null,"POS",null,null,"Poverty Level 101-150",null,null,null,null,null,null,null,null,null,null,"Poverty Level 151%-200%",null,null,null,null,null,null,null,null,null,null,"Poverty Level 201%-250%",null,null,null,null,null,null,null,null,null,null,null,null,null,null,null,null,"Age",{"$f":"IF(MONTH(IF(CS2=\"\",$CS$1,CS2))<MONTH(CS5),YEAR(IF(CS2=\"\",$CS$1,CS2))-YEAR(CS5)-1,IF(MONTH(IF(CS2=\"\",$CS$1,CS2))>MONTH(CS5),YEAR(IF(CS2=\"\",$CS$1,CS2))-YEAR(CS5),IF(DAY(IF(CS2=\"\",$CS$1,CS2))<DAY(CS5),YEAR(IF(CS2=\"\",$CS$1,CS2))-YEAR(CS5)-1,YEAR(IF(CS2=\"\",$CS$1,CS2))-YEAR(CS5))))","v":{"$error":"#VALUE!"}},{"$error":"#VALUE!"},{"$error":"#VALUE!"},{"$error":"#VALUE!"},{"$error":"#VALUE!"},{"$error":"#VALUE!"},{"$error":"#VALUE!"},{"$error":"#VALUE!"},{"$error":"#VALUE!"},{"$error":"#VALUE!"},{"$error":"#VALUE!"},{"$error":"#VALUE!"},null,null,null,null,null,null,null,"For Subsidy Calculator","Smoker Surcharge"]
{"$rows_left_out":108}
{"sheet":"WPS Health Plan Subsidy Calcs","index":6,"n_rows":270,"n_cols":116,"rows_kept":270,"cut":false,"hidden":true,"merged":[[1,0,1,4],[1,6,1,10],[15,0,15,3],[15,6,15,9]]}
[]
["SUBSIDY CALCULATIONS",null,null,null,null,null,"HDHP"]
["Household Size","Household Income","100% of FPL","% of Poverty Level","Maximum %",null,"Household Size","Household Income","100% of FPL","% of Poverty Level","Maximum %"]
[{"$f":"'WPS Health Plan Quote'!D17","v":0},{"$f":"'WPS Health Plan Quote'!H17","v":0},{"$f":"IF(A4=0,0,IF(A4=1,C79,C79+((A4-1)*C80)))","v":0},{"$f":"ROUND(IF(ISERROR(B4/C4),0,B4/C4),4)","v":0},{"$f":"IF(D4<1,0,SUM(B19:B20))","v":0},null,{"$f":"#REF!","v":{"$error":"#REF!"}},{"$f":"#REF!","v":{"$error":"#REF!"}},{"$f":"IF(G4=0,0,IF(G4=1,11490,11490+((G4-1)*4020)))","v":{"$error":"#REF!"}},{"$f":"H4/I4","v":{"$error":"#REF!"}},{"$f":"IF(OR(J4>4,J4<1),0,SUM(H19:H20))","v":{"$error":"#REF!"}}]
[]
["Min Income","Max Income","Min Premium Cap","Max Premium Cap",null,null,"Min Income","Max Income","Min Premium Cap","Max Premium Cap"]
{"$rows_left_out":264}