{"text_format":"1","workbook":"xlsx","n_sheets":3,"sheets":["WPS Quote","WPS Tables","WPS Rating Factors"],"not_rendered":{"charts":0,"images":1,"macros":1,"external_links":0,"defined_names":2,"comments":0,"pivot_tables":0},"unopened":[],"bounds":{"document_bytes":16777216,"sheet_cells":100000,"rows_first":2000,"rows_last":500,"rows_between":2000,"halvings":0,"cell_chars":16384,"cell_head_chars":4096},"cells_cut":0,"cells_raw":0,"read":"whole","date_system":"1900"}

{"sheet":"WPS Quote","index":0,"n_rows":65,"n_cols":19,"rows_kept":65,"cut":false,"hidden":false,"merged":[[34,1,34,3],[34,12,34,13],[4,16,5,17],[12,1,13,14],[17,3,17,4],[31,7,33,7],[31,8,31,11],[31,12,31,13],[31,14,33,14],[32,9,33,9],[32,10,33,10],[32,12,32,13],[33,12,33,13],[31,1,31,3],[32,1,32,3],[33,1,33,3],[88,1,88,14],[43,1,43,3],[43,12,43,13],[44,1,44,3],[44,12,44,13],[50,14,52,14],[53,1,53,3],[53,12,53,13],[54,1,54,3],[54,12,54,13],[50,4,52,5],[54,4,54,5],[54,6,54,7],[52,1,52,3],[54,8,54,11],[51,1,51,3],[35,1,35,3],[35,12,35,13],[50,6,52,7],[50,8,52,11],[50,12,52,13],[37,1,37,3],[37,12,37,13],[38,12,38,13],[39,1,39,3],[39,12,39,13],[40,12,40,13],[41,1,41,3],[41,12,41,13],[50,1,50,3]]}
[null,null,null,null,null,null,null,null,null,null,null,null,null,"Quote Date: ",{"$f":"TODAY()","v":"2023-07-21"}]
[null,null,null,null,null,null,null,null,null,null,null,null,null,"Valid Through: ","2024-12-31"]
[]
[]
[null,null,null,null,null,null,null,null,null,null,null,null,null,null,null,null,{"$f":"HYPERLINK('WPS Tables'!O1,\"Enroll Now\")","v":"Enroll Now"}]
[]
[]
[]
[]
[]
{"$rows_left_out":56}
{"sheet":"WPS Tables","index":1,"n_rows":27,"n_cols":15,"rows_kept":27,"cut":false,"hidden":true,"merged":[[3,1,3,2],[3,5,3,6],[3,8,3,9],[9,5,9,6],[9,8,9,9]]}
[null,null,null,null,null,null,null,null,null,null,null,null,null,"On Exchange Link","https://my.wpshealth.com/en/Individual/healthplanhome?WebsiteId=b5bgurh&state=pjn2yxr&producttype=tvewa9w"]
[null,null,null,null,null,null,null,null,null,null,null,null,null,"Off Exchange Link","https://my.wpshealth.com/en/Individual/healthplanhome?WebsiteId=b5bgurh&state=pjn2yxr&producttype=tvewa9w"]
[null,null,null,null,null,null,null,null,null,null,null,null,null,"NOTE: These plan names are supposed to have \"| Statewide Network\" at the end, but do to size constraints, im leaving that off and putting it in the title of the categorey"]
[null,"WPS County Selection",null,null,null,"Spouse Selection",null,null,"App. Tobacco",null,null,null,null,"WPS PPO Bronze $6,500 with 3 Free PCP Visits","https://www.wpshealth.com/resources/sbc/files/2023/81974WI1880048-00.pdf"]
[null,null,null,null,null,"Indicator",{"$f":"IF('WPS Quote'!D20=G6,1,IF('WPS Quote'!D20=G7,2,3))","v":1},null,"Indicator",{"$f":"IF('WPS Quote'!E28=J6,1,IF('WPS Quote'!E28=J7,2,3))","v":1},null,null,null,"WPS PPO Bronze $9,450","https://www.wpshealth.com/resources/sbc/files/2024/81974WI1880030-00.pdf"]
[null,"Oconto",2,null,null,1,null,null,1,null,null,null,null,"WPS PPO Catastrophic $9,100 with 3 Free PCP Visits","https://www.wpshealth.com/resources/sbc/files/2023/81974WI1880044-00.pdf"]
[null,null,null,null,null,2,"No",null,2,"No",null,null,null,"WPS PPO HDHP Bronze $6,000","https://www.wpshealth.com/resources/sbc/files/2023/81974WI1880042-00.pdf"]
[null,null,null,null,null,3,"Yes",null,3,"Yes",null,null,null,"WPS PPO HDHP Bronze $7,500","https://www.wpshealth.com/resources/sbc/files/2023/81974WI1880049-00.pdf"]
[null,null,null,null,null,null,null,null,null,null,null,null,null,"Delta Dental PPO Individual Plan","https://secure.wpsic.com/sales-materials/files/33873_2023-wps-hi-hp-delta-dental-rate-sheet.pdf"]
[null,null,null,null,null,"Dependent Sel.",null,null,"Spouse Tabacco"]
{"$rows_left_out":18}
{"sheet":"WPS Rating Factors","index":2,"n_rows":93,"n_cols":117,"rows_kept":93,"cut":false,"hidden":true,"merged":[[5,56,5,66],[5,67,5,77],[5,78,5,88],[32,98,32,99],[33,98,33,99]]}
[null,null,null,null,null,null,null,null,null,null,null,null,null,null,null,null,null,null,null,null,null,null,null,null,null,null,null,null,null,null,null,null,null,null,null,null,null,null,null,null,null,null,null,null,null,null,null,null,null,null,null,null,null,null,null,null,null,null,null,null,null,null,null,null,null,null,null,null,null,null,null,null,null,null,null,null,null,null,null,null,null,null,null,null,null,null,null,null,null,null,null,null,null,null,null,"Eff. Date",{"$f":"'WPS Quote'!I18","v":"00:00:00"}]
[null,null,null,null,null,null,null,null,null,null,null,null,null,null,null,null,null,null,null,null,null,null,null,null,null,null,null,null,null,null,null,null,null,null,null,null,null,null,null,null,null,null,null,null,null,null,null,null,null,null,null,null,null,null,null,null,null,null,null,null,null,null,null,null,null,null,null,null,null,null,null,null,null,null,null,null,null,null,null,null,null,null,null,null,null,null,null,null,null,null,null,null,"the formula starting in",null,null,"Rate Calc Date"]
[null,null,null,null,null,null,null,null,null,null,null,null,null,null,null,null,null,null,null,null,null,null,null,null,null,null,null,null,null,null,null,null,null,null,null,null,null,null,null,null,null,null,null,null,null,null,null,null,null,null,null,null,null,null,null,null,null,null,null,null,null,null,null,null,null,null,null,null,null,null,null,null,null,null,null,null,null,null,null,null,null,null,null,null,null,null,null,null,null,null,null,null,"row 2 column CS used to"]
[null,null,null,null,null,null,null,null,"On/Off",null,null,null,null,null,null,null,null,null,null,null,null,null,null,null,null,null,null,null,null,null,null,null,null,null,null,null,null,null,null,null,null,null,null,null,null,null,null,null,null,null,null,null,null,null,null,null,null,null,null,null,null,null,null,null,null,null,null,null,null,null,null,null,null,null,null,null,null,null,null,null,null,null,null,null,null,null,null,null,null,null,null,null,"be for plan changes, no ",null,null,"Member","Applicant","Spouse","Dep. 1","Dep. 2","Dep. 3","Dep. 4","Dep. 5","Dep. 6","Dep. 7","Dep. 8","Dep. 9","Dep. 10",null,null,null,null,null,"TOTAL"]
[null,null,null,null,null,null,null,"PPO",{"$f":"VLOOKUP('WPS Quote'!I20,'WPS Tables'!$B$6:$C$28,2,FALSE)","v":{"$error":"#N/A"}},null,null,null,null,null,null,null,null,null,null,"Original",null,null,null,null,null,null,null,null,null,null,null,null,null,null,null,null,null,null,null,null,null,null,null,null,null,null,null,null,null,null,null,null,null,null,null,null,null,null,null,null,null,null,null,null,null,null,null,null,null,null,null,null,null,null,null,null,null,null,null,null,null,null,null,null,null,null,null,null,null,null,null,null,"longer needed since",null,null,"DOB",{"$f":"IF('WPS Quote'!C28=\"\",\"\",'WPS Quote'!C28)","v":""},{"$f":"IF('WPS Quote'!C30=\"\",\"\",'WPS Quote'!C30)","v":""},{"$f":"IF('WPS Quote'!G28=\"\",\"\",'WPS Quote'!G28)","v":""},{"$f":"IF('WPS Quote'!G30=\"\",\"\",'WPS Quote'!G30)","v":""},{"$f":"IF('WPS Quote'!I28=\"\",\"\",'WPS Quote'!I28)","v":""},{"$f":"IF('WPS Quote'!I30=\"\",\"\",'WPS Quote'!I30)","v":""},{"$f":"IF('WPS Quote'!L28=\"\",\"\",'WPS Quote'!L28)","v":""},{"$f":"IF('WPS Quote'!L30=\"\",\"\",'WPS Quote'!L30)","v":""},{"$f":"IF('WPS Quote'!N28=\"\",\"\",'WPS Quote'!N28)","v":""},{"$f":"IF('WPS Quote'!N30=\"\",\"\",'WPS Quote'!N30)","v":""},{"$f":"IF('WPS Quote'!T28=\"\",\"\",'WPS Quote'!T28)","v":""},{"$f":"IF('WPS Quote'!T30=\"\",\"\",'WPS Quote'!T30)","v":""},null,null,null,null,null,null,null,null,"Value of the"]
[null,null,null,"Age","Tobacco",null,null,"HDHP",2,null,null,null,null,null,null,"PPO",1,null,null,"Plan Order",null,null,null,"Aspirus Arise","ThedaCare","ThedaCare","ThedaCare","Aurora","Aurora","Aurora","Aurora","Aurora","Aurora","Aurora","Aurora","Aurora","Aurora","Aurora","Aurora",null,null,null,null,null,null,null,null,"Retail","PCP","SPC","ER",null,null,"POS",null,null,"Poverty Level 101-150",null,null,null,null,null,null,null,null,null,null,"Poverty Level 151%-200%",null,null,null,null,null,null,null,null,null,null,"Poverty Level 201%-250%",null,null,null,null,null,null,null,null,null,null,null,null,null,"facets rates",null,null,"Age",{"$f":"IF(MONTH(IF(CS2=\"\",$CS$1,CS2))<MONTH(CS5),YEAR(IF(CS2=\"\",$CS$1,CS2))-YEAR(CS5)-1,IF(MONTH(IF(CS2=\"\",$CS$1,CS2))>MONTH(CS5),YEAR(IF(CS2=\"\",$CS$1,CS2))-YEAR(CS5),IF(DAY(IF(CS2=\"\",$CS$1,CS2))<DAY(CS5),YEAR(IF(CS2=\"\",$CS$1,CS2))-YEAR(CS5)-1,YEAR(IF(CS2=\"\",$CS$1,CS2))-YEAR(CS5))))","v":{"$error":"#VALUE!"}},{"$error":"#VALUE!"},{"$error":"#VALUE!"},{"$error":"#VALUE!"},{"$error":"#VALUE!"},{"$error":"#VALUE!"},{"$error":"#VALUE!"},{"$error":"#VALUE!"},{"$error":"#VALUE!"},{"$error":"#VALUE!"},{"$error":"#VALUE!"},{"$error":"#VALUE!"},null,null,null,null,null,null,null,"For Subsidy Calculator","Smoker Surcharge"]
["Index Rate",null,"Age","Factor","Factor",null,null,"County","OCI Region","Factor","Network 1","Network 2","Network 3",null,null,"Network","HMO Factor","POS Factor",null,"Plan Number","AV Value","Plan Name","HIOS #","Pricing Value","Plan Name","HIOS #","Pricing Value","Plan Name","HIOS #","Pricing Value","Plan Name","HIOS #","Pricing Value","Plan Name","HIOS #","Pricing Value","Plan Name","HIOS #","Pricing Value","Plan Type","Metal","Deductible (IN)","Deductible (OUT)","Coins. (IN)","Coins. (OUT)","OOP Max (IN)","OOP Max (OUT)","Copay","Copay","Copay","Copay","Free\nPCP Visits","Prev/Gen-Prf/Gen-Oth/Brand-Prf/Brand-Oth/Spcl","Factor","Rate","Metal","Deductible (IN)","Deductible (OUT)","Coins. (IN)","Coins. (OUT)","OOP Max (IN)","OOP Max (OUT)","Retail","PCP","SPC","ER","Prescription Plan\nPreventive/Generic/Preferred/\nNon-Preferred/Specialty","Deductible (IN)","Deductible (OUT)","Coins. (IN)","Coins. (OUT)","OOP Max (IN)","OOP Max (OUT)","Retail","PCP","SPC","ER","Prescription Plan\nPreventive/Generic/Preferred/\nNon-Preferred/Specialty","Deductible (IN)","Deductible (OUT)","Coins. (IN)","Coins. (OUT)","OOP Max (IN)","OOP Max (OUT)","Retail","PCP","SPC","ER","Prescription Plan\nPreventive/Generic/Preferred/\nNon-Preferred/Specialty",null,null,null,null,null,null,"Tobacco",{"$f":"IF('WPS Quote'!E28=\"Yes\",3,1)","v":1},{"$f":"IF('WPS Quote'!E30=\"Yes\",3,1)","v":1},1,1,1,1,1,1,1,1,1,1,null,null,null,null,null,null,null,"Always Assume No Smoker","and children under 19"]
[966.52,null,0,0.76500000000000001,1,null,1,null,null,0,null,{"$f":"\"\"","v":""},{"$f":"\"\"","v":""},null,2,"Select",0,null,null,15,null,"WPS PPO Bronze $6,500 with 3 Free PCP Visits | Statewide Network","81974WI1880048",null,"ThedaCare HMO 6000","84670WI1250101",0.49209999999999998,"Aurora HMO 6000","84670WI1250107",0.49209999999999998,"Aurora and ThedaCare HMO 6000","84670WI1250117",5681.25,"Aurora and Bellin HMO 6000","84670WI1250127",{"$error":"#VALUE!"},"ProHealth and Aurora HMO 6000","84670WI1250137",{"$error":"#VALUE!"},"PPO","Bronze",6500,13000,0.2,0.5,9100,23000,"D/C","3 Free","D/C","D/C",3,"$0 preventive, D/C all others",0.52449999999999997,{"$f":"ROUND(ROUND(ROUND(ROUND(BB8*1,4)*$A$8,2)*VLOOKUP($I$5,$G$9:$J$31,4,FALSE),2)*$CS$8,2)+ROUND(ROUND(ROUND(ROUND(BB8*1,4)*$A$8,2)*VLOOKUP($I$5,$G$9:$J$31,4,FALSE),2)*$CT$8,2)+ROUND(ROUND(ROUND(ROUND(BB8*1,4)*$A$8,2)*VLOOKUP($I$5,$G$9:$J$31,4,FALSE),2)*$CU$8,2)+ROUND(ROUND(ROUND(ROUND(BB8*1,4)*$A$8,2)*VLOOKUP($I$5,$G$9:$J$31,4,FALSE),2)*$CV$8,2)+ROUND(ROUND(ROUND(ROUND(BB8*1,4)*$A$8,2)*VLOOKUP($I$5,$G$9:$J$31,4,FALSE),2)*$CW$8,2)+ROUND(ROUND(ROUND(ROUND(BB8*1,4)*$A$8,2)*VLOOKUP($I$5,$G$9:$J$31,4,FALSE),2)*$CX$8,2)+ROUND(ROUND(ROUND(ROUND(BB8*1,4)*$A$8,2)*VLOOKUP($I$5,$G$9:$J$31,4,FALSE),2)*$CY$8,2)+ROUND(ROUND(ROUND(ROUND(BB8*1,4)*$A$8,2)*VLOOKUP($I$5,$G$9:$J$31,4,FALSE),2)*$CZ$8,2)+ROUND(ROUND(ROUND(ROUND(BB8*1,4)*$A$8,2)*VLOOKUP($I$5,$G$9:$J$31,4,FALSE),2)*$DA$8,2)+ROUND(ROUND(ROUND(ROUND(BB8*1,4)*$A$8,2)*VLOOKUP($I$5,$G$9:$J$31,4,FALSE),2)*$DB$8,2)+ROUND(ROUND(ROUND(ROUND(BB8*1,4)*$A$8,2)*VLOOKUP($I$5,$G$9:$J$31,4,FALSE),2)*$DC$8,2)+ROUND(ROUND(ROUND(ROUND(BB8*1,4)*$A$8,2)*VLOOKUP($I$5,$G$9:$J$31,4,FALSE),2)*$DD$8,2)+ROUND(ROUND(ROUND(ROUND(BB8*1,4)*$A$8,2)*VLOOKUP($I$5,$G$9:$J$31,4,FALSE),2)*$CU$10,2)+ROUND(ROUND(ROUND(ROUND(BB8*1,4)*$A$8,2)*VLOOKUP($I$5,$G$9:$J$31,4,FALSE),2)*$CV$10,2)+ROUND(ROUND(ROUND(ROUND(BB8*1,4)*$A$8,2)*VLOOKUP($I$5,$G$9:$J$31,4,FALSE),2)*$CW$10,2)+ROUND(ROUND(ROUND(ROUND(BB8*1,4)*$A$8,2)*VLOOKUP($I$5,$G$9:$J$31,4,FALSE),2)*$CX$10,2)+ROUND(ROUND(ROUND(ROUND(BB8*1,4)*$A$8,2)*VLOOKUP($I$5,$G$9:$J$31,4,FALSE),2)*$CY$10,2)+ROUND(ROUND(ROUND(ROUND(BB8*1,4)*$A$8,2)*VLOOKUP($I$5,$G$9:$J$31,4,FALSE),2)*$CZ$10,2)+ROUND(ROUND(ROUND(ROUND(BB8*1,4)*$A$8,2)*VLOOKUP($I$5,$G$9:$J$31,4,FALSE),2)*$DA$10,2)+ROUND(ROUND(ROUND(ROUND(BB8*1,4)*$A$8,2)*VLOOKUP($I$5,$G$9:$J$31,4,FALSE),2)*$DB$10,2)+ROUND(ROUND(ROUND(ROUND(BB8*1,4)*$A$8,2)*VLOOKUP($I$5,$G$9:$J$31,4,FALSE),2)*$DC$10,2)+ROUND(ROUND(ROUND(ROUND(BB8*1,4)*$A$8,2)*VLOOKUP($I$5,$G$9:$J$31,4,FALSE),2)*$DD$10,2)","v":{"$error":"#N/A"}},"Bronze",7150,"-",0,"-",7150,"-","D/C","D/C","D/C","D/C","$0 preventive, D/C all others",7150,"-",0,"-",7150,"-","D/C","D/C","D/C","D/C","$0 preventive, D/C all others",7150,"-",0,"-",7150,"-","D/C","D/C","D/C","D/C","$0 preventive, D/C all others",null,null,null,null,null,null,"Over 21 Value",{"$f":"IF(CS5=\"\",0,VLOOKUP(CS6,$C$8:$E$58,2)*IF(CS7=3,VLOOKUP(CS6,$C$8:$E$58,3),1))","v":0},{"$f":"IF(CT5=\"\",0,VLOOKUP(CT6,$C$8:$E$58,2)*IF(CT7=3,VLOOKUP(CT6,$C$8:$E$58,3),1))","v":0},{"$f":"IF(CU5=\"\",0,VLOOKUP(CU6,$C$8:$E$58,2)*IF(CU7=3,VLOOKUP(CU6,$C$8:$E$58,3),1)*IF(CU6<21,0,1))","v":0},0,0,0,0,0,0,0,0,0,null,null,null,null,null,{"$f":"SUM(CS8:DD8)","v":0},null,{"$f":"ROUND(ROUND(ROUND(ROUND(BB8*$Q$9,4)*$A$8,2)*VLOOKUP($I$5,$G$10:$J$26,4,FALSE),2)*$CS$12,2)+ROUND(ROUND(ROUND(ROUND(BB8*$Q$9,4)*$A$8,2)*VLOOKUP($I$5,$G$10:$J$26,4,FALSE),2)*$CT$12,2)+ROUND(ROUND(ROUND(ROUND(BB8*$Q$9,4)*$A$8,2)*VLOOKUP($I$5,$G$10:$J$26,4,FALSE),2)*$CU$12,2)+ROUND(ROUND(ROUND(ROUND(BB8*$Q$9,4)*$A$8,2)*VLOOKUP($I$5,$G$10:$J$26,4,FALSE),2)*$CV$12,2)+ROUND(ROUND(ROUND(ROUND(BB8*$Q$9,4)*$A$8,2)*VLOOKUP($I$5,$G$10:$J$26,4,FALSE),2)*$CW$12,2)+ROUND(ROUND(ROUND(ROUND(BB8*$Q$9,4)*$A$8,2)*VLOOKUP($I$5,$G$10:$J$26,4,FALSE),2)*$CX$12,2)+ROUND(ROUND(ROUND(ROUND(BB8*$Q$9,4)*$A$8,2)*VLOOKUP($I$5,$G$10:$J$26,4,FALSE),2)*$CY$12,2)+ROUND(ROUND(ROUND(ROUND(BB8*$Q$9,4)*$A$8,2)*VLOOKUP($I$5,$G$10:$J$26,4,FALSE),2)*$CZ$12,2)+ROUND(ROUND(ROUND(ROUND(BB8*$Q$9,4)*$A$8,2)*VLOOKUP($I$5,$G$10:$J$26,4,FALSE),2)*$DA$12,2)+ROUND(ROUND(ROUND(ROUND(BB8*$Q$9,4)*$A$8,2)*VLOOKUP($I$5,$G$10:$J$26,4,FALSE),2)*$DB$12,2)+ROUND(ROUND(ROUND(ROUND(BB8*$Q$9,4)*$A$8,2)*VLOOKUP($I$5,$G$10:$J$26,4,FALSE),2)*$DC$12,2)+ROUND(ROUND(ROUND(ROUND(BB8*$Q$9,4)*$A$8,2)*VLOOKUP($I$5,$G$10:$J$26,4,FALSE),2)*$DD$12,2)+ROUND(ROUND(ROUND(ROUND(BB8*$Q$9,4)*$A$8,2)*VLOOKUP($I$5,$G$10:$J$26,4,FALSE),2)*$D$8,2)*$DJ$13","v":{"$error":"#N/A"}},{"$f":"BC8-DL8","v":{"$error":"#N/A"}}]
[null,null,15,0.83299999999999996,1,null,2,"Oconto",16,0.96299999999999997,null,{"$f":"\"\"","v":""},{"$f":"\"\"","v":""},null,1,{"$f":"VLOOKUP(I5,$G$8:$M$80,5,FALSE)","v":{"$error":"#N/A"}},0.93500000000000005,1,null,14,null,"WPS PPO Bronze $9,450 | Statewide Network","81974WI1880030",null,"ThedaCare HMO 6850","84670WI1250102",0.46560000000000001,"Aurora HMO 6850","84670WI1250108",0.46560000000000001,"Aurora and ThedaCare HMO 6850","84670WI1250118",6499.35,"Aurora and Bellin HMO 6850","84670WI1250128",{"$error":"#VALUE!"},"ProHealth and Aurora HMO 6850","84670WI1250138",{"$error":"#VALUE!"},"PPO","Bronze",9450,18900,0,0.3,9450,24900,"D/C","D/C","D/C","D/C",0,"$0 preventive, D/C all others",0.49270000000000003,{"$f":"ROUND(ROUND(ROUND(ROUND(BB9*1,4)*$A$8,2)*VLOOKUP($I$5,$G$9:$J$31,4,FALSE),2)*$CS$8,2)+ROUND(ROUND(ROUND(ROUND(BB9*1,4)*$A$8,2)*VLOOKUP($I$5,$G$9:$J$31,4,FALSE),2)*$CT$8,2)+ROUND(ROUND(ROUND(ROUND(BB9*1,4)*$A$8,2)*VLOOKUP($I$5,$G$9:$J$31,4,FALSE),2)*$CU$8,2)+ROUND(ROUND(ROUND(ROUND(BB9*1,4)*$A$8,2)*VLOOKUP($I$5,$G$9:$J$31,4,FALSE),2)*$CV$8,2)+ROUND(ROUND(ROUND(ROUND(BB9*1,4)*$A$8,2)*VLOOKUP($I$5,$G$9:$J$31,4,FALSE),2)*$CW$8,2)+ROUND(ROUND(ROUND(ROUND(BB9*1,4)*$A$8,2)*VLOOKUP($I$5,$G$9:$J$31,4,FALSE),2)*$CX$8,2)+ROUND(ROUND(ROUND(ROUND(BB9*1,4)*$A$8,2)*VLOOKUP($I$5,$G$9:$J$31,4,FALSE),2)*$CY$8,2)+ROUND(ROUND(ROUND(ROUND(BB9*1,4)*$A$8,2)*VLOOKUP($I$5,$G$9:$J$31,4,FALSE),2)*$CZ$8,2)+ROUND(ROUND(ROUND(ROUND(BB9*1,4)*$A$8,2)*VLOOKUP($I$5,$G$9:$J$31,4,FALSE),2)*$DA$8,2)+ROUND(ROUND(ROUND(ROUND(BB9*1,4)*$A$8,2)*VLOOKUP($I$5,$G$9:$J$31,4,FALSE),2)*$DB$8,2)+ROUND(ROUND(ROUND(ROUND(BB9*1,4)*$A$8,2)*VLOOKUP($I$5,$G$9:$J$31,4,FALSE),2)*$DC$8,2)+ROUND(ROUND(ROUND(ROUND(BB9*1,4)*$A$8,2)*VLOOKUP($I$5,$G$9:$J$31,4,FALSE),2)*$DD$8,2)+ROUND(ROUND(ROUND(ROUND(BB9*1,4)*$A$8,2)*VLOOKUP($I$5,$G$9:$J$31,4,FALSE),2)*$CU$10,2)+ROUND(ROUND(ROUND(ROUND(BB9*1,4)*$A$8,2)*VLOOKUP($I$5,$G$9:$J$31,4,FALSE),2)*$CV$10,2)+ROUND(ROUND(ROUND(ROUND(BB9*1,4)*$A$8,2)*VLOOKUP($I$5,$G$9:$J$31,4,FALSE),2)*$CW$10,2)+ROUND(ROUND(ROUND(ROUND(BB9*1,4)*$A$8,2)*VLOOKUP($I$5,$G$9:$J$31,4,FALSE),2)*$CX$10,2)+ROUND(ROUND(ROUND(ROUND(BB9*1,4)*$A$8,2)*VLOOKUP($I$5,$G$9:$J$31,4,FALSE),2)*$CY$10,2)+ROUND(ROUND(ROUND(ROUND(BB9*1,4)*$A$8,2)*VLOOKUP($I$5,$G$9:$J$31,4,FALSE),2)*$CZ$10,2)+ROUND(ROUND(ROUND(ROUND(BB9*1,4)*$A$8,2)*VLOOKUP($I$5,$G$9:$J$31,4,FALSE),2)*$DA$10,2)+ROUND(ROUND(ROUND(ROUND(BB9*1,4)*$A$8,2)*VLOOKUP($I$5,$G$9:$J$31,4,FALSE),2)*$DB$10,2)+ROUND(ROUND(ROUND(ROUND(BB9*1,4)*$A$8,2)*VLOOKUP($I$5,$G$9:$J$31,4,FALSE),2)*$DC$10,2)+ROUND(ROUND(ROUND(ROUND(BB9*1,4)*$A$8,2)*VLOOKUP($I$5,$G$9:$J$31,4,FALSE),2)*$DD$10,2)","v":{"$error":"#N/A"}},"Bronze",6250,"-",0.2,"-",7150,"-","D/C","D/C","D/C","D/C","$0 preventive, D/C all others",6250,"-",0.2,"-",7150,"-","D/C","D/C","D/C","D/C","$0 preventive, D/C all others",6250,"-",0.2,"-",7150,"-","D/C","D/C","D/C","D/C","$0 preventive, D/C all others",null,null,null,null,null,null,"21 and Under Value",{"$f":"IF(CS5=\"\",0,IF(CS6<21,1,0))","v":0},{"$f":"IF(CT5=\"\",0,IF(CT6<21,1,0))","v":0},{"$f":"IF(CU5=\"\",0,IF(CU6<21,VLOOKUP(CU6,$C$8:$D$58,2),0))","v":0},0,0,0,0,0,0,0,0,0,null,null,null,null,null,{"$f":"IF(SUM(CS9:DD9)>3,3,SUM(CS9:DD9))","v":0},null,{"$error":"#N/A"},{"$f":"BC9-DL9","v":{"$error":"#N/A"}}]
[null,null,16,0.85899999999999999,1,null,3,"Barron",8,0.89300000000000002,null,{"$f":"\"\"","v":""},{"$f":"\"\"","v":""},null,3,{"$f":"VLOOKUP(I5,$G$8:$M$80,6,FALSE)","v":{"$error":"#N/A"}},{"$f":"IF(#REF!=\"Arise\",0.959,IF(#REF!=\"Aspirus Arise\",0.909,IF(#REF!=\"Arise Metro\",0.909,IF(#REF!=\"Southern\",0.93,IF(#REF!=\"Healthy U\",0.93,0)))))","v":{"$error":"#REF!"}},null,null,13,null,"HMO Silver 7000","86584WI0010001",null,"ThedaCare HMO 5000","84670WI1250100",{"$f":"ROUND(BB10*0.909,4)","v":0.57150000000000001},"Aurora HMO 5000","84670WI1250106",{"$f":"ROUND(BB10*0.909,4)","v":0.57150000000000001},"Aurora and ThedaCare HMO 5000","84670WI1250116",{"$f":"ROUND(BE10*0.909,4)","v":0},"Aurora and Bellin HMO 5000","84670WI1250126",{"$f":"ROUND(BH10*0.909,4)","v":{"$error":"#VALUE!"}},"ProHealth and Aurora HMO 5000","84670WI1250136",{"$f":"ROUND(BK10*0.909,4)","v":{"$error":"#VALUE!"}},"HMO","Silver",7000,"-",0,"-",7000,"-","$0/$10",30,60,250,0,"$0 / $0 / $20 / $50 / $75 / 50% to $1000",0.62870000000000004,{"$f":"ROUND(ROUND(ROUND(ROUND(BB10*$R$9,4)*$A$8,2)*VLOOKUP($I$5,$G$10:$J$28,4,FALSE),2)*$CS$8,2)+ROUND(ROUND(ROUND(ROUND(BB10*$R$9,4)*$A$8,2)*VLOOKUP($I$5,$G$10:$J$28,4,FALSE),2)*$CT$8,2)+ROUND(ROUND(ROUND(ROUND(BB10*$R$9,4)*$A$8,2)*VLOOKUP($I$5,$G$10:$J$28,4,FALSE),2)*$CU$8,2)+ROUND(ROUND(ROUND(ROUND(BB10*$R$9,4)*$A$8,2)*VLOOKUP($I$5,$G$10:$J$28,4,FALSE),2)*$CV$8,2)+ROUND(ROUND(ROUND(ROUND(BB10*$R$9,4)*$A$8,2)*VLOOKUP($I$5,$G$10:$J$28,4,FALSE),2)*$CW$8,2)+ROUND(ROUND(ROUND(ROUND(BB10*$R$9,4)*$A$8,2)*VLOOKUP($I$5,$G$10:$J$28,4,FALSE),2)*$CX$8,2)+ROUND(ROUND(ROUND(ROUND(BB10*$R$9,4)*$A$8,2)*VLOOKUP($I$5,$G$10:$J$28,4,FALSE),2)*$CY$8,2)+ROUND(ROUND(ROUND(ROUND(BB10*$R$9,4)*$A$8,2)*VLOOKUP($I$5,$G$10:$J$28,4,FALSE),2)*$CZ$8,2)+ROUND(ROUND(ROUND(ROUND(BB10*$R$9,4)*$A$8,2)*VLOOKUP($I$5,$G$10:$J$28,4,FALSE),2)*$DA$8,2)+ROUND(ROUND(ROUND(ROUND(BB10*$R$9,4)*$A$8,2)*VLOOKUP($I$5,$G$10:$J$28,4,FALSE),2)*$DB$8,2)+ROUND(ROUND(ROUND(ROUND(BB10*$R$9,4)*$A$8,2)*VLOOKUP($I$5,$G$10:$J$28,4,FALSE),2)*$DC$8,2)+ROUND(ROUND(ROUND(ROUND(BB10*$R$9,4)*$A$8,2)*VLOOKUP($I$5,$G$10:$J$28,4,FALSE),2)*$DD$8,2)+ROUND(ROUND(ROUND(ROUND(BB10*$R$9,4)*$A$8,2)*VLOOKUP($I$5,$G$10:$J$28,4,FALSE),2)*$D$8,2)*$DJ$9","v":{"$error":"#N/A"}},"Silver",0,"-",0,"-",400,"-","$0/$10",30,60,250,"$0 / $0 / $20 / $50 / $75 / 50% to $400",400,"-",0,"-",1400,"-","$0/$10",30,60,250,"$0 / $0 / $20 / $50 / $75 / 50% to $1000",3000,"-",0,"-",5000,"-","$0/$10",30,60,250,"$0 / $0 / $20 / $50 / $75 / 50% to $1000",null,null,null,null,null,null,null,null,null,{"$f":"LARGE(CU9:DD9,1)","v":0},{"$f":"LARGE(CU9:DD9,2)","v":0},{"$f":"LARGE(CU9:DD9,3)","v":0},null,null,null,null,null,null,null,null,null,null,null,null,{"$f":"SUM(DJ8:DJ9)","v":0},null,{"$error":"#N/A"},{"$error":"#N/A"}]
{"$rows_left_out":83}