{"text_format":"1","workbook":"xlsx","n_sheets":10,"sheets":["Agent Resources","Input","Group Rate Summary","Age Rate Matrix","Alternates","Changes","Tables","Rating Formula","Output for PDFs","Logos"],"not_rendered":{"charts":0,"images":31,"macros":1,"external_links":0,"defined_names":16,"comments":1,"pivot_tables":0},"unopened":[],"bounds":{"document_bytes":16777216,"sheet_cells":100000,"rows_first":2000,"rows_last":500,"rows_between":2000,"halvings":0,"cell_chars":16384,"cell_head_chars":4096},"cells_cut":0,"cells_raw":0,"read":"whole","date_system":"1900"}

{"sheet":"Agent Resources","index":0,"n_rows":27,"n_cols":15,"rows_kept":27,"cut":false,"hidden":true,"merged":[]}
[]
[]
[]
[]
["Small Group Brochure",null,"Arise Premier Network",null,"First Health Network",null,"Teledoc",null,"Exercise Rewards",null,"Express Scripts",null,"Vision Discount",null,"$0 Rx List"]
[]
[]
[]
{"$rows_left_out":20}
{"sheet":"Input","index":1,"n_rows":201,"n_cols":50,"rows_kept":201,"cut":false,"hidden":false,"merged":[[40,8,40,11],[37,10,37,13],[198,40,198,43],[1,17,1,20],[11,11,11,14],[16,4,16,11],[10,4,10,6],[12,4,12,6],[1,1,1,14],[12,11,12,14],[14,4,14,6],[6,4,6,14],[8,4,8,14],[20,4,20,5],[18,6,18,7],[27,9,27,10],[198,27,198,30],[198,34,198,37],[18,13,18,14],[19,4,19,7],[18,11,18,12],[18,4,18,5],[19,13,19,14],[19,11,19,12],[25,4,25,15],[23,6,23,7],[22,6,22,7],[21,6,21,7],[20,6,20,7],[23,13,23,14],[22,13,22,14],[21,13,21,14],[23,4,23,5],[22,4,22,5],[21,4,21,5],[20,13,20,14],[23,11,23,12],[22,11,22,12],[21,11,21,12],[20,11,20,12]]}
[null," VERSION 1 2025",null,null,null,null,null,null,null,null,null,null,null,null,null,null,null,null,null,null,null,null,null,null,null,null,"in from Census Entry display; COPY to right",null,null,null,null,null,null,"sort Census Entry data on 1-3-5(d)-2",null,null,null,null,null,"convert member type back, then COPY to Census Entry area"]
[null,"2025 WI SMALL GROUP ACA RATING CALCULATOR",null,null,null,null,null,null,null,null,null,null,null,null,null,null,null,{"$f":"Tables!B4&\" Census Entry\"","v":"WPS Census Entry"},null,null,true,null,null,null,null,null,1,2,3,4,5,null,null,1,2,3,4,5,null,null,null,null,null,null,null,"This data used for Cov Type on Output for PDFs tab."]
[null,null,null,null,null,null,null,null,null,null,null,null,null,null,null,null,null,null,null,"(E)mp","Date",null,null,null,null,null,null,null,"(E)mp",null,null,null,"< 21 ",null,null,"(E)mp",null,null,null,null,null,"(E)mp"]
[null,null,null,null,null,null,null,null,null,null,null,null,null,null,null,null,null,"Emp",null,"(S)ps","of Birth",null,"Member",null,null,null,"EE","Member","(S)ps","DOB",null,null,"Dep","EE","Member","(S)ps","DOB",null,null,"EE","Member","(S)ps","DOB",null,null,"EE num &",null,"Mem"]
[null,null,"Quoting Company",null,null,null,null,null,null,null,null,null,null,null,null,null,null,"#","Member Name","(D)ep","m/d/yy","Age","Rate",null,null,null,"#","Name","(D)ep","mm/dd/yyyy","Age",null,"Count","#","Name","(D)ep","mm/dd/yyyy","Age",null,"#","Name","(D)ep","mm/dd/yyyy","Age",null,"EE type","Age","Rate","Member Name"]
[null,null,null,null,null,null,null,null,null,null,null,null,null,null,null,null,null,{"$f":"IF(T6=\"\",\"\",IF(T6=\"E\",1,R5))","v":""},null,null,null,{"$f":"IF(OR(U6=\"\",ISBLANK($E$11)=TRUE),\"\",TRUNC((YEAR(Tables!$E$18)-YEAR(U6))+(MONTH(Tables!$E$18)-MONTH(U6))/12+0.92,0)-1+IF(AND(MONTH(Tables!$E$18)=MONTH(U6),DAY(U6)=1),1,0))","v":""},{"$f":"IFERROR(IF(T6=\"\",\"\",'Rating Formula'!J4),\"         -\")","v":""},1,null,null,{"$f":"IF(ISNUMBER(R6)=TRUE,R6,\"\")","v":""},{"$f":"IF(ISNUMBER(R6)=TRUE,S6,\"\")","v":""},{"$f":"IF(ISNUMBER(R6)=TRUE,IF(T6=\"D\",IF(V6>20,\"Z\",\"Y\"),T6),\"\")","v":""},{"$f":"IF(ISNUMBER(R6)=TRUE,U6,\"\")","v":""},{"$f":"IF(ISNUMBER(R6)=TRUE,V6,\"\")","v":""},null,{"$f":"IF(AH6=\"\",\"\",IF(AJ6=\"Y\",AG5+1,0))","v":0},1,0,"E","1984-06-04",41,null,null,{"$f":"IF(AI6=\"\",\"\",AI6)","v":0},{"$f":"IF(OR(AJ6=\"Y\",AJ6=\"Z\"),\"D\",UPPER(AJ6))","v":"E"},{"$f":"IF(AK6=\"\",\"\",AK6)","v":"1984-06-04"},null,null,{"$f":"R6&T6","v":""},{"$f":"V6","v":""},{"$f":"W6","v":""},{"$f":"IF(S6=0,\"\",S6)","v":""},1]
[null,null,"Agency Name",null,null,null,null,null,null,null,null,null,null,null,null,null,null,{"$f":"IF(T7=\"\",\"\",IF(T7=\"E\",R6+1,R6))","v":""},null,null,null,{"$f":"IF(OR(U7=\"\",ISBLANK($E$11)=TRUE),\"\",TRUNC((YEAR(Tables!$E$18)-YEAR(U7))+(MONTH(Tables!$E$18)-MONTH(U7))/12+0.92,0)-1+IF(AND(MONTH(Tables!$E$18)=MONTH(U7),DAY(U7)=1),1,0))","v":""},{"$f":"IFERROR(IF(T7=\"\",\"\",'Rating Formula'!J5),\"         -\")","v":""},2,null,null,"","","","","",null,0,2,0,"E","1982-02-22",43,null,null,{"$f":"IF(AI7=\"\",\"\",AI7)","v":0},{"$f":"IF(OR(AJ7=\"Y\",AJ7=\"Z\"),\"D\",UPPER(AJ7))","v":"E"},{"$f":"IF(AK7=\"\",\"\",AK7)","v":"1982-02-22"},null,null,"","","","",{"$f":"1+AX6","v":2}]
[null,null,null,null,null,null,null,null,null,null,null,null,null,null,null,null,null,{"$f":"IF(T8=\"\",\"\",IF(T8=\"E\",R7+1,R7))","v":""},null,null,null,{"$f":"IF(OR(U8=\"\",ISBLANK($E$11)=TRUE),\"\",TRUNC((YEAR(Tables!$E$18)-YEAR(U8))+(MONTH(Tables!$E$18)-MONTH(U8))/12+0.92,0)-1+IF(AND(MONTH(Tables!$E$18)=MONTH(U8),DAY(U8)=1),1,0))","v":""},{"$f":"IFERROR(IF(T8=\"\",\"\",'Rating Formula'!J6),\"         -\")","v":""},3,null,null,"","","","","",null,0,3,0,"E","2000-07-05",25,null,null,0,{"$f":"IF(OR(AJ8=\"Y\",AJ8=\"Z\"),\"D\",UPPER(AJ8))","v":"E"},"2000-07-05",null,null,"","","","",{"$f":"1+AX7","v":3}]
{"$rows_left_out":194}
{"sheet":"Group Rate Summary","index":2,"n_rows":66,"n_cols":12,"rows_kept":66,"cut":false,"hidden":false,"merged":[[7,1,7,9],[1,1,1,6],[2,1,2,6],[4,1,4,9],[5,1,5,9],[6,1,6,9]]}
[null,{"$f":"Input!B1","v":" VERSION 1 2025"},null,null,null,null,null,null,null,null,null,"Hide"]
[null,{"$f":"IF(Input!E9=\"\",\"\",Input!E9)","v":""}]
[null,{"$f":"\"Effective \"&Input!E11","v":"Effective "}]
[]
[null,{"$f":"Tables!B4&\" Employee Premium Rate Summary\"","v":"WPS Employee Premium Rate Summary"}]
[null,{"$f":"IF(Tables!B4=\"WPS\",\"PLAN - \"&Tables!B4&\" \"&Tables!C15&\" \"&Input!E17&\" (HIOS ID: \"&Input!L13&\")                   COUNTY: \"&PROPER(Input!E13),\"PLAN - \"&Tables!B4&\" \"&Input!E17&\" (HIOS ID: \"&Input!L13&\")           COUNTY: \"&PROPER(Input!E13))","v":"PLAN - WPS 0  (HIOS ID: )                   COUNTY: "}]
[null,{"$f":"IF(Input!G21=\"no cvrge\",\"DEDUCTIBLE: $\"&TEXT(Input!E21,\"##,###\")&\" \"&Tables!B36&\"      COINSURANCE: \"&Input!E22&\"      OUT-OF-POCKET: $\"&TEXT(Input!E23,\"##,###\"),\"DEDUCTIBLE: $\"&TEXT(Input!E21,\"##,###\")&\"/$\"&TEXT(Input!G21,\"##,###\")&\" \"&Tables!B36&\"      COINSURANCE: \"&Input!E22&\"/\"&Input!G22&\"      OUT-OF-POCKET: $\"&TEXT(Input!E23,\"##,###\")&\"/$\"&TEXT(Input!G23,\"##,###\"))","v":{"$error":"#N/A"}}]
[null,{"$f":"\"COPAYS -  ER: \"&Tables!B33&Input!L24&\"  |  Teledoc: \"&Tables!B33&Input!L20&\"  |  Retail: \"&Tables!B33&Input!L21&\"  |  PCP: \"&Tables!B33&Input!L22&\"  |  Spcl: \"&Tables!B33&Input!L23&\"  |  Prev Care: $0  |  Rx: \"&Tables!B34","v":{"$error":"#N/A"}}]
{"$rows_left_out":59}
{"sheet":"Age Rate Matrix","index":3,"n_rows":50,"n_cols":8,"rows_kept":50,"cut":false,"hidden":false,"merged":[[9,1,9,9],[38,1,38,9],[1,1,1,6],[2,1,2,6],[4,1,4,9],[5,1,5,9],[6,1,6,9],[7,1,7,9]]}
[null,{"$f":"Input!B1","v":" VERSION 1 2025"}]
[null,{"$f":"'Group Rate Summary'!B2:G2","v":""}]
[null,{"$f":"'Group Rate Summary'!B3:G3","v":"Effective "}]
[]
[null,{"$f":"Tables!B4&\" Age Matrix Summary\"","v":"WPS Age Matrix Summary"}]
[null,{"$f":"'Group Rate Summary'!B6","v":"PLAN - WPS 0  (HIOS ID: )                   COUNTY: "}]
[null,{"$f":"'Group Rate Summary'!B7","v":{"$error":"#N/A"}}]
[null,{"$f":"'Group Rate Summary'!B8","v":{"$error":"#N/A"}}]
{"$rows_left_out":43}
{"sheet":"Alternates","index":4,"n_rows":57,"n_cols":41,"rows_kept":57,"cut":false,"hidden":false,"merged":[[1,1,1,9],[2,1,2,9],[3,1,3,9]]}
[null,{"$f":"Input!B1","v":" VERSION 1 2025"},null,null,null,null,null,null,null,null,null,null,null,null,null,null,"hide","hide","hide","hide","hide","hide","hide","hide","hide","hide","hide","hide","hide","hide","hide","hide","hide","hide","hide","hide","hide","hide","hide","hide","hide"]
[null,{"$f":"'Group Rate Summary'!B2:G2","v":""}]
[null,{"$f":"\"Small Group Alternates - \"&'Group Rate Summary'!B3:G3","v":"Small Group Alternates - Effective "},null,null,null,null,null,null,null,null,null,null,null,null,null,null,"IGNORE BLUE FONT DUE TO CONDITIONAL FORMATTING WHEN NO PLAN SELECTED!"]
[null,{"$f":"Input!E15&\" Network\"","v":" Network"}]
[null,null,null,null,null,null,null,null,null,null,null,null,null,null,null,null,"WPS Health Plan Alternates",null,null,null,null,null,null,null,null,null,null,null,null,"WPS Alternates"]
[null,null,null,null,"HDHP",null,null,"Retail",null,null,"Pre-","Drug Benefit",null,null,null,null,null,null,null,"HDHP",null,null,"Retail",null,null,"Pre-","Drug Benefit",null,null,null,null,null,"HDHP",null,null,"Retail",null,null,"Pre-","Drug Benefit"]
[null,null,null,null,"Deductible","ER","Teledoc","Clinic","PCP","Specialist","ventive","Generic Pref | Generic Non-Pref","Monthly",null,null,null,null,null,null,"Deductible","ER","Teledoc","Clinic","PCP","Specialist","ventive","Generic Pref | Generic Non-Pref","Monthly",null,null,null,null,"Deductible","ER","Teledoc","Clinic","PCP","Specialist","ventive","Generic Pref | Generic Non-Pref","Monthly"]
[null,"     Plan Name","HIOS ID","Plan Design","Type","Copay","Copay","Copay","Copay","Copay","Care","Brand Pref | Brand Non-Pref | Specialty","  Rate *",null,null,null,"Plan Name","HIOS ID","Plan Design","Type","Copay","Copay","Copay","Copay","Copay","Care","Brand Pref | Brand Non-Pref | Specialty","Rate",null,"Plan Name","HIOS ID","Plan Design","Type","Copay","Copay","Copay","Copay","Copay","Care","Brand Pref | Brand Non-Pref | Specialty","Rate"]
{"$rows_left_out":50}
{"sheet":"Changes","index":5,"n_rows":36,"n_cols":11,"rows_kept":36,"cut":false,"hidden":true,"merged":[]}
[]
[null,2020]
[null,"TEST","chaged tab names to get rid of special characters (Output - Renewal, Base Rate & Expenses, Age & Tobacco, and Area & Network"]
[null,null,"created new Input tab using data validation"]
[null,null,"removed tabs:"]
[null,null,null,"Area and Network"]
[null,null,null,"Age and Tobacco"]
[null,null,null,"Arise Benefit",null,null,null,null,null,null,"to HIDE:"]
{"$rows_left_out":29}
{"sheet":"Tables","index":6,"n_rows":109,"n_cols":78,"rows_kept":109,"cut":false,"hidden":true,"merged":[[2,29,2,31],[2,32,2,37],[2,38,2,40],[2,41,2,46]]}
[null,null,null,null,"Census Validation",null,null,null,null,"=IF(MONTH($E$18)<10,BO6,BP6)",null,null,null,"=IF(MONTH($E$18)<10,BT6,BU6)",null,"Only need these formulas if a quarterly filing happens, then also go to columns BM - BZ",null,null,null,null,null,null,null,null,1,2,3,4,5,6,7,8,9,10,11,12,13,14,15,16,17,18,19,20,21,22,23,24,25,26,null,"Age Factors"]
[null,"Company (radio buttons)",null,null,null,null,"Area Factors",null,null,null,null,null,null,null,null,null,null,null,null,null,null,null,null,null,null,null,null,null,null,null,null,null,null,null,null,null,null,null,null,null,null,null,null,null,null,null,null,null,null,null,null," ",2019,null,null,null,2017,null,null,null,"This page only."]
[null,2,"1=WPS Health Plan,  2=WPS",null,"E",null,"Rated","WPS Health Plan","WHP",null,null,null,"WPS",null,null,null,null,null,null,null,null,null,null,null,null,null,"Benefit","Deductible",null,"In-Network",null,null,"Copays",null,null,null,null,null,"Out-of-Network",null,null,"Copays",null,null,null,null,null,"Drug Benefit - Long","Drug Benefit - Short","Family",null,null,"ACA","Non -",null,null,"ACA",null,null,null,null,null,null,null,"WPS Health Plan","WHP",null,null,null,null,"WPS",null,null,null,null,null,"Q1 - Q3","Q4"]
[null,{"$f":"IF(B3=1,\"WPS Health Plan\",IF(B3=2,\"WPS\",\"Co err\"))","v":"WPS"},null,null,"S",null,"Counties","Counties","Reg","Fx",null,"WPS counties","Reg","Fx",null,"Plan Benefits Dropdown Display",null,"WPS Health Plan","HIOS ID","WPS","HIOS ID","WPS Health Plan - OOS","WPS - OOS",null,"Plan Marketing Name","HIOS ID","Factor","Type","Style","Deduct","Coins","OOP","Teledoc","Rtl Clinic","PCP","Spcl","Urgent","ER","Deduct","Coins","OOP","Teledoc","Rtl Clinic","PCP","Spcl","Urgent","ER","Generic Pref/Generic Non-Pref/Brand Pref/Brand Non-Pref/Specialty","Gen Pref/Gen NP/Brnd Pref/Brnd NP/Spcl","Deductible",null,"Age","Factor","Smoker",null,"Age","Factor",null,null,null,null,null,null,null,"Counties","Reg","Fx",null,null,"WPS counties","Reg","Fx",null,null,"Plan Marketing Name","HIOS ID","Factor","Factor"]
[null,null,null,null,"D",null,null,null,null,null,null,null,null,null,null,null,null,null,null,null,null,null,null,1,"WPS PPO Platinum $500","81974WI1930002",0.93320000000000003,"PPO Copay","Copay",500,"20%",1700,0,10,35,70,null,500,1000,"50%",11000,"no cvrge","D/C","D/C","D/C",null,500,"$10 Gnr Pref / $25 Gnr Non-Pref / $50 Brnd Pref / $90 Brnd Non-Pref / Spcl Plan Deductible, then Coinsurance","$10 / $25 / $50 / $90 / D/C"," ",null,0,0.76500000000000001,{"$f":"ROUND(BA5*'Rating Formula'!$C$12,2)","v":{"$error":"#N/A"}},null,0,0.63500000000000001,null,null,null,null,null,null,null,null,null,"Q1-Q3","Q4",null,null,null,"Q1-Q3","Q4",null,"WPS WI PPO Platinum 500","81974WI1930002",0.98580000000000001,0.9365]
["Print Controls",null,null,null,null,1,{"$f":"IF($B$4=\"WPS\",L6,IF(H6=\"\",\"\",H6))","v":"ADAMS"},"BROWN",16,0.75600000000000001,null,"ADAMS",15,1.0980000000000001,null,{"$f":"IF(LEFT($C$15,12)=\"First Health\",IF($B$4=\"WPS Health Plan\",IF(V6=\"\",\"\",V6),IF(W6=\"\",\"\",W6)),IF($B$4=\"WPS\",IF(T6=\"\",\"\",T6),IF(R6=\"\",\"\",R6)))","v":"WPS PPO Platinum $500"},1,"WPS HMO Platinum $500","84670WI1330101","WPS PPO Platinum $500","81974WI1930002",{"$f":"R48","v":"WPS POS Platinum $500 OOS"},{"$f":"T27","v":"WPS PPO Platinum $500 OOS"},2,"WPS PPO Gold $1,000","81974WI1930009",0.77559999999999996,"PPO Copay","Copay",1000,"20%",7350,0,10,35,70,null,500,2000,"50%",12000,"no cvrge","D/C","D/C","D/C",null,500,"$10 Gnr Pref / $25 Gnr Non-Pref / $50 Brnd Pref / $90 Brnd Non-Pref / Spcl Plan Deductible, then Coinsurance","$10 / $25 / $50 / $90 / D/C"," ",null,15,0.83299999999999996,{"$f":"ROUND(BA6*'Rating Formula'!$C$12,2)","v":{"$error":"#N/A"}},null,15,0.63500000000000001,null,null,null,null,null,null,null,"BROWN",16,0.75600000000000001,0.75600000000000001,null,"ADAMS",15,1.0980000000000001,1.0980000000000001,null,"WPS WI PPO Gold 1000","81974WI1930009",0.81430000000000002,0.79390000000000005]
[true,"Group Rate Summary Print checkbox",null,null,null,{"$f":"1+F6","v":2},"ASHLAND","CALUMET",11,0.72699999999999998,null,"ASHLAND",5,1.2569999999999999,null,{"$f":"IF(LEFT($C$15,12)=\"First Health\",IF($B$4=\"WPS Health Plan\",IF(V7=\"\",\"\",V7),IF(W7=\"\",\"\",W7)),IF($B$4=\"WPS\",IF(T7=\"\",\"\",T7),IF(R7=\"\",\"\",R7)))","v":"WPS PPO Gold $1,000"},{"$f":"1+Q6","v":2},"WPS HMO Gold $1,000","84670WI1330102","WPS PPO Gold $1,000","81974WI1930009",{"$f":"R49","v":"WPS POS Gold $1,000 OOS"},{"$f":"T28","v":"WPS PPO Gold $1,000 OOS"},3,"WPS PPO Gold $1,500","81974WI1930040",0.76980000000000004,"PPO Copay","Copay",1500,"10%",6750,0,10,35,70,null,500,3000,"50%",13000,"no cvrge","D/C","D/C","D/C",null,500,"$10 Gnr Pref / $25 Gnr Non-Pref / $50 Brnd Pref / $90 Brnd Non-Pref / Spcl Plan Deductible, then Coinsurance","$10 / $25 / $50 / $90 / D/C"," ",null,16,0.85899999999999999,{"$f":"ROUND(BA7*'Rating Formula'!$C$12,2)","v":{"$error":"#N/A"}},null,16,0.63500000000000001,null,null,null,null,null,null,null,"CALUMET",11,0.72699999999999998,0.72699999999999998,null,"ASHLAND",5,1.2569999999999999,1.2569999999999999,null,"WPS WI PPO Gold 1500","81974WI1930040",0.79310000000000003,0.77329999999999999]
[false,"Age Rate Matrix Print checkbox",null,null,null,{"$f":"1+F7","v":3},"BARRON","DODGE",11,0.72699999999999998,null,"BARRON",8,1.22,null,"WPS PPO Gold $1,500",3,"WPS HMO Gold $1,500","84670WI1330104","WPS PPO Gold $1,500","81974WI1930040","WPS POS Gold $1,500 OOS","WPS PPO Gold $1,500 OOS",4,"WPS PPO Gold $2,000","81974WI1930041",0.74529999999999996,"PPO Copay","Copay",2000,"20%",5950,0,10,35,70,null,500,4000,"50%",14000,"no cvrge","D/C","D/C","D/C",null,500,"$10 Gnr Pref / $25 Gnr Non-Pref / $50 Brnd Pref / $90 Brnd Non-Pref / Spcl Plan Deductible, then Coinsurance","$10 / $25 / $50 / $90 / D/C"," ",null,17,0.88500000000000001,{"$f":"ROUND(BA8*'Rating Formula'!$C$12,2)","v":{"$error":"#N/A"}},null,17,0.63500000000000001,null,null,null,null,null,null,null,"DODGE",11,0.72699999999999998,0.72699999999999998,null,"BARRON",8,1.22,1.22,null,"WPS WI PPO Gold 2000","81974WI1930041",0.75139999999999996,0.73260000000000003]
{"$rows_left_out":102}
{"sheet":"Rating Formula","index":7,"n_rows":193,"n_cols":10,"rows_kept":193,"cut":false,"hidden":true,"merged":[[2,1,2,2]]}
[]
[null,null,null,null,null,null,null,null,null,"Member"]
[null,"Rating Formula",null,null,null,"WPS Health Plan",null,"WPS",null,"Rates    "]
[null,"Base Rate",{"$f":"IF(Tables!B4=\"WPS\",'Rating Formula'!H4,'Rating Formula'!F4)","v":999.92},null,null,786.41,null,999.92,1,{"$f":"IF(Input!T6=\"\",\"\",IF(Input!AG6>3,0,VLOOKUP(Input!$V6,Tables!$AZ$5:$BB$56,3,TRUE)))","v":""}]
[null,"Trend Factor",{"$f":"IF(Tables!B4=\"WPS\",'Rating Formula'!H5,'Rating Formula'!F5)","v":{"$error":"#N/A"}},null,null,{"$f":"Tables!C18","v":{"$error":"#N/A"}},null,{"$f":"Tables!C18","v":{"$error":"#N/A"}},2,{"$f":"IF(Input!T7=\"\",\"\",IF(Input!AG7>3,0,VLOOKUP(Input!$V7,Tables!$AZ$5:$BB$56,3,TRUE)))","v":""}]
[null,null,null,null,null,null,null,null,3,{"$f":"IF(Input!T8=\"\",\"\",IF(Input!AG8>3,0,VLOOKUP(Input!$V8,Tables!$AZ$5:$BB$56,3,TRUE)))","v":""}]
[null,"Trended Base Rate",{"$f":"IF(Tables!B4=\"WPS\",H7,F7)","v":{"$error":"#N/A"}},null,null,{"$f":"ROUND(F4*F5,2)","v":{"$error":"#N/A"}},null,{"$f":"ROUND(H4*H5,2)","v":{"$error":"#N/A"}},4,{"$f":"IF(Input!T9=\"\",\"\",IF(Input!AG9>3,0,VLOOKUP(Input!$V9,Tables!$AZ$5:$BB$56,3,TRUE)))","v":""}]
[null,"Benefit Factor",{"$f":"IF(Tables!B4=\"WPS\",'Rating Formula'!H8,'Rating Formula'!F8)","v":{"$error":"#N/A"}},null,null,{"$f":"VLOOKUP(Input!L13,Tables!Z5:AA109,2,FALSE)","v":{"$error":"#N/A"}},null,{"$f":"VLOOKUP(Input!L13,Tables!Z5:AA109,2,FALSE)","v":{"$error":"#N/A"}},5,{"$f":"IF(Input!T10=\"\",\"\",IF(Input!AG10>3,0,VLOOKUP(Input!$V10,Tables!$AZ$5:$BB$56,3,TRUE)))","v":""}]
{"$rows_left_out":186}
{"sheet":"Output for PDFs","index":8,"n_rows":204,"n_cols":20,"rows_kept":204,"cut":false,"hidden":true,"merged":[[1,1,1,5],[2,1,2,5]]}
[]
[null,{"$f":"'Group Rate Summary'!B2:G2","v":""}]
[null,{"$f":"'Group Rate Summary'!B3","v":"Effective "}]
[]
[null,{"$f":"IF(Tables!B4=\"WPS Health Plan\",\"WPS Health Plan\",\"WPS\")& \" Renewal Presentation\"","v":"WPS Renewal Presentation"}]
[null,{"$f":"'Group Rate Summary'!B6","v":"PLAN - WPS 0  (HIOS ID: )                   COUNTY: "}]
[null,{"$f":"'Group Rate Summary'!B7","v":{"$error":"#N/A"}}]
[null,{"$f":"'Group Rate Summary'!B8","v":{"$error":"#N/A"}}]
{"$rows_left_out":197}
{"sheet":"Logos","index":9,"n_rows":10,"n_cols":4,"rows_kept":10,"cut":false,"hidden":true,"merged":[]}
[]
[]
[]
[null,null,{"$f":"IF(Tables!B4=\"WPS Health Plan\",\"WPSHPlogo\",\"WPSlogo\")","v":"WPSlogo"}]
[]
[null,null,"this switches the logos depending on the company chosen on the Input tab"]
[null,null,"it is used in conjuction with the range name of \"Logo\" on PDFs"]
[null,null,"find \"Logo\" using the Name Manager - WILL BE EITHER C2 OR D2 DEPENDING ON C4"]
{"$rows_left_out":2}