{"text_format":"1","workbook":"xlsx","n_sheets":10,"sheets":["Agent Resources","Input","Group Rate Summary","Age Rate Matrix","Alternates","Changes","Tables","Rating Formula","Output for PDFs","Logos"],"not_rendered":{"charts":0,"images":31,"macros":1,"external_links":0,"defined_names":16,"comments":1,"pivot_tables":0},"unopened":[],"bounds":{"document_bytes":16777216,"sheet_cells":100000,"rows_first":2000,"rows_last":500,"rows_between":2000,"halvings":0,"cell_chars":16384,"cell_head_chars":4096},"cells_cut":0,"cells_raw":0,"read":"whole","date_system":"1900"}

{"sheet":"Agent Resources","index":0,"n_rows":27,"n_cols":15,"rows_kept":27,"cut":false,"hidden":true,"merged":[]}
[]
[]
[]
[]
["Small Group Brochure",null,"Arise Premier Network",null,"First Health Network",null,"Teledoc",null,"Exercise Rewards",null,"Express Scripts",null,"Vision Discount",null,"$0 Rx List"]
[]
[]
[]
[]
[]
[]
[]
[]
["Calculator Instructions",null,"Employer Application",null,"Employee Application",null,"Small Group Checklist",null,"Disclosure Form",null,"F A Q",null,"Spreadsheet Enrollment",null,"SBC Link"]
[]
[]
[]
[]
[]
[]
[]
[]
[]
[]
[]
[]
["Small Group Brochure",null,"Statewide Network",null,"First Health Network",null,"Teledoc",null,"Exercise Rewards",null,"Express Scripts",null,"Vision Discount",null,"$0 Rx List"]

{"sheet":"Input","index":1,"n_rows":201,"n_cols":50,"rows_kept":201,"cut":false,"hidden":false,"merged":[[40,8,40,11],[37,10,37,13],[198,40,198,43],[1,17,1,20],[11,11,11,14],[16,4,16,11],[10,4,10,6],[12,4,12,6],[1,1,1,14],[12,11,12,14],[14,4,14,6],[6,4,6,14],[8,4,8,14],[20,4,20,5],[18,6,18,7],[27,9,27,10],[198,27,198,30],[198,34,198,37],[18,13,18,14],[19,4,19,7],[18,11,18,12],[18,4,18,5],[19,13,19,14],[19,11,19,12],[25,4,25,15],[23,6,23,7],[22,6,22,7],[21,6,21,7],[20,6,20,7],[23,13,23,14],[22,13,22,14],[21,13,21,14],[23,4,23,5],[22,4,22,5],[21,4,21,5],[20,13,20,14],[23,11,23,12],[22,11,22,12],[21,11,21,12],[20,11,20,12]]}
[null," VERSION 1 2025",null,null,null,null,null,null,null,null,null,null,null,null,null,null,null,null,null,null,null,null,null,null,null,null,"in from Census Entry display; COPY to right",null,null,null,null,null,null,"sort Census Entry data on 1-3-5(d)-2",null,null,null,null,null,"convert member type back, then COPY to Census Entry area"]
[null,"2025 WI SMALL GROUP ACA RATING CALCULATOR",null,null,null,null,null,null,null,null,null,null,null,null,null,null,null,{"$f":"Tables!B4&\" Census Entry\"","v":"WPS Census Entry"},null,null,true,null,null,null,null,null,1,2,3,4,5,null,null,1,2,3,4,5,null,null,null,null,null,null,null,"This data used for Cov Type on Output for PDFs tab."]
[null,null,null,null,null,null,null,null,null,null,null,null,null,null,null,null,null,null,null,"(E)mp","Date",null,null,null,null,null,null,null,"(E)mp",null,null,null,"< 21 ",null,null,"(E)mp",null,null,null,null,null,"(E)mp"]
[null,null,null,null,null,null,null,null,null,null,null,null,null,null,null,null,null,"Emp",null,"(S)ps","of Birth",null,"Member",null,null,null,"EE","Member","(S)ps","DOB",null,null,"Dep","EE","Member","(S)ps","DOB",null,null,"EE","Member","(S)ps","DOB",null,null,"EE num &",null,"Mem"]
[null,null,"Quoting Company",null,null,null,null,null,null,null,null,null,null,null,null,null,null,"#","Member Name","(D)ep","m/d/yy","Age","Rate",null,null,null,"#","Name","(D)ep","mm/dd/yyyy","Age",null,"Count","#","Name","(D)ep","mm/dd/yyyy","Age",null,"#","Name","(D)ep","mm/dd/yyyy","Age",null,"EE type","Age","Rate","Member Name"]
[null,null,null,null,null,null,null,null,null,null,null,null,null,null,null,null,null,{"$f":"IF(T6=\"\",\"\",IF(T6=\"E\",1,R5))","v":""},null,null,null,{"$f":"IF(OR(U6=\"\",ISBLANK($E$11)=TRUE),\"\",TRUNC((YEAR(Tables!$E$18)-YEAR(U6))+(MONTH(Tables!$E$18)-MONTH(U6))/12+0.92,0)-1+IF(AND(MONTH(Tables!$E$18)=MONTH(U6),DAY(U6)=1),1,0))","v":""},{"$f":"IFERROR(IF(T6=\"\",\"\",'Rating Formula'!J4),\"         -\")","v":""},1,null,null,{"$f":"IF(ISNUMBER(R6)=TRUE,R6,\"\")","v":""},{"$f":"IF(ISNUMBER(R6)=TRUE,S6,\"\")","v":""},{"$f":"IF(ISNUMBER(R6)=TRUE,IF(T6=\"D\",IF(V6>20,\"Z\",\"Y\"),T6),\"\")","v":""},{"$f":"IF(ISNUMBER(R6)=TRUE,U6,\"\")","v":""},{"$f":"IF(ISNUMBER(R6)=TRUE,V6,\"\")","v":""},null,{"$f":"IF(AH6=\"\",\"\",IF(AJ6=\"Y\",AG5+1,0))","v":0},1,0,"E","1984-06-04",41,null,null,{"$f":"IF(AI6=\"\",\"\",AI6)","v":0},{"$f":"IF(OR(AJ6=\"Y\",AJ6=\"Z\"),\"D\",UPPER(AJ6))","v":"E"},{"$f":"IF(AK6=\"\",\"\",AK6)","v":"1984-06-04"},null,null,{"$f":"R6&T6","v":""},{"$f":"V6","v":""},{"$f":"W6","v":""},{"$f":"IF(S6=0,\"\",S6)","v":""},1]
[null,null,"Agency Name",null,null,null,null,null,null,null,null,null,null,null,null,null,null,{"$f":"IF(T7=\"\",\"\",IF(T7=\"E\",R6+1,R6))","v":""},null,null,null,{"$f":"IF(OR(U7=\"\",ISBLANK($E$11)=TRUE),\"\",TRUNC((YEAR(Tables!$E$18)-YEAR(U7))+(MONTH(Tables!$E$18)-MONTH(U7))/12+0.92,0)-1+IF(AND(MONTH(Tables!$E$18)=MONTH(U7),DAY(U7)=1),1,0))","v":""},{"$f":"IFERROR(IF(T7=\"\",\"\",'Rating Formula'!J5),\"         -\")","v":""},2,null,null,"","","","","",null,0,2,0,"E","1982-02-22",43,null,null,{"$f":"IF(AI7=\"\",\"\",AI7)","v":0},{"$f":"IF(OR(AJ7=\"Y\",AJ7=\"Z\"),\"D\",UPPER(AJ7))","v":"E"},{"$f":"IF(AK7=\"\",\"\",AK7)","v":"1982-02-22"},null,null,"","","","",{"$f":"1+AX6","v":2}]
[null,null,null,null,null,null,null,null,null,null,null,null,null,null,null,null,null,{"$f":"IF(T8=\"\",\"\",IF(T8=\"E\",R7+1,R7))","v":""},null,null,null,{"$f":"IF(OR(U8=\"\",ISBLANK($E$11)=TRUE),\"\",TRUNC((YEAR(Tables!$E$18)-YEAR(U8))+(MONTH(Tables!$E$18)-MONTH(U8))/12+0.92,0)-1+IF(AND(MONTH(Tables!$E$18)=MONTH(U8),DAY(U8)=1),1,0))","v":""},{"$f":"IFERROR(IF(T8=\"\",\"\",'Rating Formula'!J6),\"         -\")","v":""},3,null,null,"","","","","",null,0,3,0,"E","2000-07-05",25,null,null,0,{"$f":"IF(OR(AJ8=\"Y\",AJ8=\"Z\"),\"D\",UPPER(AJ8))","v":"E"},"2000-07-05",null,null,"","","","",{"$f":"1+AX7","v":3}]
[null,null,"Group Name",null,null,null,null,null,null,null,null,null,null,null,null,null,null,"","","","",{"$f":"IF(OR(U9=\"\",ISBLANK($E$11)=TRUE),\"\",TRUNC((YEAR(Tables!$E$18)-YEAR(U9))+(MONTH(Tables!$E$18)-MONTH(U9))/12+0.92,0)-1+IF(AND(MONTH(Tables!$E$18)=MONTH(U9),DAY(U9)=1),1,0))","v":""},{"$f":"IFERROR(IF(T9=\"\",\"\",'Rating Formula'!J7),\"         -\")","v":""},4,null,null,"","","","","",null,"","","","","","",null,null,"","","",null,null,"","","","",4]
[null,null,null,null,null,null,null,null,null,null,null,null,null,null,null,null,null,{"$f":"IF(T10=\"\",\"\",IF(T10=\"E\",R9+1,R9))","v":""},"","","",{"$f":"IF(OR(U10=\"\",ISBLANK($E$11)=TRUE),\"\",TRUNC((YEAR(Tables!$E$18)-YEAR(U10))+(MONTH(Tables!$E$18)-MONTH(U10))/12+0.92,0)-1+IF(AND(MONTH(Tables!$E$18)=MONTH(U10),DAY(U10)=1),1,0))","v":""},{"$f":"IFERROR(IF(T10=\"\",\"\",'Rating Formula'!J8),\"         -\")","v":""},5,null,null,"","","","","",null,"","","","","","",null,null,"","","",null,null,"","","","",5]
[null,null,"Effective Date",null,null,null,null,null,null,null,null,null,null,null,null,null,null,{"$f":"IF(T11=\"\",\"\",IF(T11=\"E\",R10+1,R10))","v":""},"","","",{"$f":"IF(OR(U11=\"\",ISBLANK($E$11)=TRUE),\"\",TRUNC((YEAR(Tables!$E$18)-YEAR(U11))+(MONTH(Tables!$E$18)-MONTH(U11))/12+0.92,0)-1+IF(AND(MONTH(Tables!$E$18)=MONTH(U11),DAY(U11)=1),1,0))","v":""},{"$f":"IFERROR(IF(T11=\"\",\"\",'Rating Formula'!J9),\"         -\")","v":""},6,null,null,"","","","","",null,"","","","","","",null,null,"","","",null,null,"","","","",6]
[null,null,null,null,null,null,null,null,"WI Region",null,null,"HIOS ID / SBC Link",null,null,null,null,null,"","","","",{"$f":"IF(OR(U12=\"\",ISBLANK($E$11)=TRUE),\"\",TRUNC((YEAR(Tables!$E$18)-YEAR(U12))+(MONTH(Tables!$E$18)-MONTH(U12))/12+0.92,0)-1+IF(AND(MONTH(Tables!$E$18)=MONTH(U12),DAY(U12)=1),1,0))","v":""},{"$f":"IFERROR(IF(T12=\"\",\"\",'Rating Formula'!J10),\"         -\")","v":""},7,null,null,"","","","","",null,"","","","","","",null,null,"","","",null,null,"","","","",7]
[null,null,"Group County",null,null,null,null,null,{"$f":"IFERROR(VLOOKUP(E13,Tables!L6:M76,2,FALSE),\"\")","v":""},null,null,{"$f":"IFERROR(IF(Tables!B4=\"WPS Health Plan\",HYPERLINK(\"https://www.wpshealth.com/resources/sbc/files/2025/\"&LEFT(VLOOKUP(Input!E17,Tables!R6:S68,2,FALSE),14)&\"-00.pdf\",VLOOKUP(Input!E17,Tables!R6:S68,2,FALSE)),HYPERLINK(\"https://www.wpshealth.com/resources/sbc/files/2025/\"&LEFT(VLOOKUP(Input!E17,Tables!T6:U47,2,FALSE),14)&\"-00.pdf\",VLOOKUP(Input!E17,Tables!T6:U47,2,FALSE))),\"\")","v":""},null,null,null,null,null,{"$f":"IF(T13=\"\",\"\",IF(T13=\"E\",R12+1,R12))","v":""},"","","",{"$f":"IF(OR(U13=\"\",ISBLANK($E$11)=TRUE),\"\",TRUNC((YEAR(Tables!$E$18)-YEAR(U13))+(MONTH(Tables!$E$18)-MONTH(U13))/12+0.92,0)-1+IF(AND(MONTH(Tables!$E$18)=MONTH(U13),DAY(U13)=1),1,0))","v":""},{"$f":"IFERROR(IF(T13=\"\",\"\",'Rating Formula'!J11),\"         -\")","v":""},8,null,null,"","","","","",null,{"$f":"IF(AH13=\"\",\"\",IF(AJ13=\"Y\",AG12+1,0))","v":""},"","","","","",null,null,"","","",null,null,"","","","",8]
[null,null,null,null,null,null,null,null,null,null,null,null,null,null,null,null,null,{"$f":"IF(T14=\"\",\"\",IF(T14=\"E\",R13+1,R13))","v":""},"","","",{"$f":"IF(OR(U14=\"\",ISBLANK($E$11)=TRUE),\"\",TRUNC((YEAR(Tables!$E$18)-YEAR(U14))+(MONTH(Tables!$E$18)-MONTH(U14))/12+0.92,0)-1+IF(AND(MONTH(Tables!$E$18)=MONTH(U14),DAY(U14)=1),1,0))","v":""},{"$f":"IFERROR(IF(T14=\"\",\"\",'Rating Formula'!J12),\"         -\")","v":""},9,null,null,"","","","","",null,"","","","","","",null,null,"","","",null,null,"","","","",9]
[null,null,"Provider Network",null,null,null,null,null,null,null,null,null,null,null,null,null,null,"","","","",{"$f":"IF(OR(U15=\"\",ISBLANK($E$11)=TRUE),\"\",TRUNC((YEAR(Tables!$E$18)-YEAR(U15))+(MONTH(Tables!$E$18)-MONTH(U15))/12+0.92,0)-1+IF(AND(MONTH(Tables!$E$18)=MONTH(U15),DAY(U15)=1),1,0))","v":""},{"$f":"IFERROR(IF(T15=\"\",\"\",'Rating Formula'!J13),\"         -\")","v":""},10,null,null,"","","","","",null,"","","","","","",null,null,"","","",null,null,"","","","",10]
[null,null,null,{"$f":"IF(E15=\" First Health POS\",\"HMO plans not available with First Health network\",\"\")","v":""},null,null,null,null,null,null,null,null,null,null,null,null,null,"","","","",{"$f":"IF(OR(U16=\"\",ISBLANK($E$11)=TRUE),\"\",TRUNC((YEAR(Tables!$E$18)-YEAR(U16))+(MONTH(Tables!$E$18)-MONTH(U16))/12+0.92,0)-1+IF(AND(MONTH(Tables!$E$18)=MONTH(U16),DAY(U16)=1),1,0))","v":""},{"$f":"IFERROR(IF(T16=\"\",\"\",'Rating Formula'!J14),\"         -\")","v":""},11,null,null,"","","","","",null,"","","","","","",null,null,"","","",null,null,"","","","",11]
[null,null,"Benefit Plan",null,null,null,null,null,null,null,null,null,null,null,null,null,null,"","","","",{"$f":"IF(OR(U17=\"\",ISBLANK($E$11)=TRUE),\"\",TRUNC((YEAR(Tables!$E$18)-YEAR(U17))+(MONTH(Tables!$E$18)-MONTH(U17))/12+0.92,0)-1+IF(AND(MONTH(Tables!$E$18)=MONTH(U17),DAY(U17)=1),1,0))","v":""},{"$f":"IFERROR(IF(T17=\"\",\"\",'Rating Formula'!J15),\"         -\")","v":""},12,null,null,"","","","","",null,"","","","","","",null,null,"","","",null,null,"","","","",12]
[null,null,null,null,null,null,null,null,null,null,null,null,null,null,null,null,null,"","","","",{"$f":"IF(OR(U18=\"\",ISBLANK($E$11)=TRUE),\"\",TRUNC((YEAR(Tables!$E$18)-YEAR(U18))+(MONTH(Tables!$E$18)-MONTH(U18))/12+0.92,0)-1+IF(AND(MONTH(Tables!$E$18)=MONTH(U18),DAY(U18)=1),1,0))","v":""},{"$f":"IFERROR(IF(T18=\"\",\"\",'Rating Formula'!J16),\"         -\")","v":""},13,null,null,"","","","","",null,"","","","","","",null,null,"","","",null,null,"","","","",13]
[null,null,null,null,"In-Network",null,"OON",null,null,null,null,"In-Network",null,"OON",null,null,null,{"$f":"IF(T19=\"\",\"\",IF(T19=\"E\",R18+1,R18))","v":""},"","","",{"$f":"IF(OR(U19=\"\",ISBLANK($E$11)=TRUE),\"\",TRUNC((YEAR(Tables!$E$18)-YEAR(U19))+(MONTH(Tables!$E$18)-MONTH(U19))/12+0.92,0)-1+IF(AND(MONTH(Tables!$E$18)=MONTH(U19),DAY(U19)=1),1,0))","v":""},{"$f":"IFERROR(IF(T19=\"\",\"\",'Rating Formula'!J17),\"         -\")","v":""},14,null,null,"","","","","",null,"","","","","","",null,null,"","","",null,null,"","","","",14]
[null,null,"Plan Type ",null,{"$f":"IF($L$13=\"\",\"\",VLOOKUP($L$13,Tables!$Z$5:$AX$109,3,FALSE))","v":""},null,null,null,null,null,"Teledoc Copay ",{"$f":"IF($L$13=\"\",\"\",VLOOKUP($L$13,Tables!$Z$5:$AX$109,8,FALSE))","v":""},null,{"$f":"IF($L$13=\"\",\"\",VLOOKUP($L$13,Tables!$Z$5:$AX$109,17,FALSE))","v":""},null,null,null,{"$f":"IF(T20=\"\",\"\",IF(T20=\"E\",R19+1,R19))","v":""},"","","",{"$f":"IF(OR(U20=\"\",ISBLANK($E$11)=TRUE),\"\",TRUNC((YEAR(Tables!$E$18)-YEAR(U20))+(MONTH(Tables!$E$18)-MONTH(U20))/12+0.92,0)-1+IF(AND(MONTH(Tables!$E$18)=MONTH(U20),DAY(U20)=1),1,0))","v":""},{"$f":"IFERROR(IF(T20=\"\",\"\",'Rating Formula'!J18),\"         -\")","v":""},15,null,null,"","","","","",null,"","","","","","",null,null,"","","",null,null,"","","","",15]
[null,null,"Deductible ",null,{"$f":"IF($L$13=\"\",\"\",VLOOKUP($L$13,Tables!$Z$5:$AX$109,5,FALSE))","v":""},null,{"$f":"IF($L$13=\"\",\"\",VLOOKUP($L$13,Tables!$Z$5:$AX$109,14,FALSE))","v":""},null,null,null,"Retail Clinic Copay ",{"$f":"IF($L$13=\"\",\"\",VLOOKUP($L$13,Tables!$Z$5:$AX$109,9,FALSE))","v":""},null,{"$f":"IF($L$13=\"\",\"\",VLOOKUP($L$13,Tables!$Z$5:$AX$109,18,FALSE))","v":""},null,null,null,"","","","",{"$f":"IF(OR(U21=\"\",ISBLANK($E$11)=TRUE),\"\",TRUNC((YEAR(Tables!$E$18)-YEAR(U21))+(MONTH(Tables!$E$18)-MONTH(U21))/12+0.92,0)-1+IF(AND(MONTH(Tables!$E$18)=MONTH(U21),DAY(U21)=1),1,0))","v":""},{"$f":"IFERROR(IF(T21=\"\",\"\",'Rating Formula'!J19),\"         -\")","v":""},16,null,null,"","","","","",null,"","","","","","",null,null,"","","",null,null,"","","","",16]
[null,null,"Coinsurance ",null,{"$f":"IF($L$13=\"\",\"\",VLOOKUP($L$13,Tables!$Z$5:$AX$109,6,FALSE))","v":""},null,{"$f":"IF($L$13=\"\",\"\",VLOOKUP($L$13,Tables!$Z$5:$AX$109,15,FALSE))","v":""},null,null,null,"PCP Copay ",{"$f":"IF($L$13=\"\",\"\",VLOOKUP($L$13,Tables!$Z$5:$AX$109,10,FALSE))","v":""},null,{"$f":"IF($L$13=\"\",\"\",VLOOKUP($L$13,Tables!$Z$5:$AX$109,19,FALSE))","v":""},null,null,null,"","","","",{"$f":"IF(OR(U22=\"\",ISBLANK($E$11)=TRUE),\"\",TRUNC((YEAR(Tables!$E$18)-YEAR(U22))+(MONTH(Tables!$E$18)-MONTH(U22))/12+0.92,0)-1+IF(AND(MONTH(Tables!$E$18)=MONTH(U22),DAY(U22)=1),1,0))","v":""},{"$f":"IFERROR(IF(T22=\"\",\"\",'Rating Formula'!J20),\"         -\")","v":""},17,null,null,"","","","","",null,"","","","","","",null,null,"","","",null,null,"","","","",17]
[null,null,"Out of Pocket",null,{"$f":"IF($L$13=\"\",\"\",VLOOKUP($L$13,Tables!$Z$5:$AX$109,7,FALSE))","v":""},null,{"$f":"IF($L$13=\"\",\"\",VLOOKUP($L$13,Tables!$Z$5:$AX$109,16,FALSE))","v":""},null,null,null,"Specialist Copay ",{"$f":"IF($L$13=\"\",\"\",VLOOKUP($L$13,Tables!$Z$5:$AX$109,11,FALSE))","v":""},null,{"$f":"IF($L$13=\"\",\"\",VLOOKUP($L$13,Tables!$Z$5:$AX$109,20,FALSE))","v":""},null,null,null,"","","","",{"$f":"IF(OR(U23=\"\",ISBLANK($E$11)=TRUE),\"\",TRUNC((YEAR(Tables!$E$18)-YEAR(U23))+(MONTH(Tables!$E$18)-MONTH(U23))/12+0.92,0)-1+IF(AND(MONTH(Tables!$E$18)=MONTH(U23),DAY(U23)=1),1,0))","v":""},{"$f":"IFERROR(IF(T23=\"\",\"\",'Rating Formula'!J21),\"         -\")","v":""},18,null,null,"","","","","",null,"","","","","","",null,null,"","","",null,null,"","","","",18]
[null,null,"Preventive Care ",null,{"$f":"IF(L13=\"\",\"\",\"$0\")","v":""},null,{"$f":"IF(L13=\"\",\"\",IF(LEFT(E20,3)=\"HMO\",\"no cvrge\",\"D/C\"))","v":""},null,null,null,"ER Copay ",{"$f":"IF($L$13=\"\",\"\",VLOOKUP($L$13,Tables!$Z$5:$AX$109,13,FALSE))","v":""},null,{"$f":"IF($L$13=\"\",\"\",VLOOKUP($L$13,Tables!$Z$5:$AX$109,22,FALSE))","v":""},null,null,null,"","","","",{"$f":"IF(OR(U24=\"\",ISBLANK($E$11)=TRUE),\"\",TRUNC((YEAR(Tables!$E$18)-YEAR(U24))+(MONTH(Tables!$E$18)-MONTH(U24))/12+0.92,0)-1+IF(AND(MONTH(Tables!$E$18)=MONTH(U24),DAY(U24)=1),1,0))","v":""},{"$f":"IFERROR(IF(T24=\"\",\"\",'Rating Formula'!J22),\"         -\")","v":""},19,null,null,"","","","","",null,"","","","","","",null,null,"","","",null,null,"","","","",19]
[null,null,null,null,null,null,null,null,null,null,null,null,null,null,null,null,null,"","","","",{"$f":"IF(OR(U25=\"\",ISBLANK($E$11)=TRUE),\"\",TRUNC((YEAR(Tables!$E$18)-YEAR(U25))+(MONTH(Tables!$E$18)-MONTH(U25))/12+0.92,0)-1+IF(AND(MONTH(Tables!$E$18)=MONTH(U25),DAY(U25)=1),1,0))","v":""},{"$f":"IFERROR(IF(T25=\"\",\"\",'Rating Formula'!J23),\"         -\")","v":""},20,null,null,"","","","","",null,"","","","","","",null,null,"","","",null,null,"","","","",20]
[null,null,"Drug Benefit ","",{"$f":"IF($L$13=\"\",\"\",VLOOKUP($L$13,Tables!$Z$5:$AX$109,23,FALSE))","v":""},null,null,null,null,null,null,null,null,null,null,null,null,"","","","",{"$f":"IF(OR(U26=\"\",ISBLANK($E$11)=TRUE),\"\",TRUNC((YEAR(Tables!$E$18)-YEAR(U26))+(MONTH(Tables!$E$18)-MONTH(U26))/12+0.92,0)-1+IF(AND(MONTH(Tables!$E$18)=MONTH(U26),DAY(U26)=1),1,0))","v":""},{"$f":"IFERROR(IF(T26=\"\",\"\",'Rating Formula'!J24),\"         -\")","v":""},21,null,null,"","","","","",null,"","","","","","",null,null,"","","",null,null,"","","","",21]
[null,null,null,null,null,null,null,null,null,null,null,null,null,null,null,null,null,"","","","",{"$f":"IF(OR(U27=\"\",ISBLANK($E$11)=TRUE),\"\",TRUNC((YEAR(Tables!$E$18)-YEAR(U27))+(MONTH(Tables!$E$18)-MONTH(U27))/12+0.92,0)-1+IF(AND(MONTH(Tables!$E$18)=MONTH(U27),DAY(U27)=1),1,0))","v":""},{"$f":"IFERROR(IF(T27=\"\",\"\",'Rating Formula'!J25),\"         -\")","v":""},22,null,null,"","","","","",null,"","","","","","",null,null,"","","",null,null,"","","","",22]
[null,null,null,null,null,"* Monthly Premium Rate:",null,null,null,{"$f":"IFERROR('Rating Formula'!C14,\"-\")","v":0},null,null,null,null,null,null,null,"","","","",{"$f":"IF(OR(U28=\"\",ISBLANK($E$11)=TRUE),\"\",TRUNC((YEAR(Tables!$E$18)-YEAR(U28))+(MONTH(Tables!$E$18)-MONTH(U28))/12+0.92,0)-1+IF(AND(MONTH(Tables!$E$18)=MONTH(U28),DAY(U28)=1),1,0))","v":""},{"$f":"IFERROR(IF(T28=\"\",\"\",'Rating Formula'!J26),\"         -\")","v":""},23,null,null,"","","","","",null,"","","","","","",null,null,"","","",null,null,"","","","",23]
[null,null,null,null,null,null,null,null,null,null,null,null,null,null,null,null,null,"","","","",{"$f":"IF(OR(U29=\"\",ISBLANK($E$11)=TRUE),\"\",TRUNC((YEAR(Tables!$E$18)-YEAR(U29))+(MONTH(Tables!$E$18)-MONTH(U29))/12+0.92,0)-1+IF(AND(MONTH(Tables!$E$18)=MONTH(U29),DAY(U29)=1),1,0))","v":""},{"$f":"IFERROR(IF(T29=\"\",\"\",'Rating Formula'!J27),\"         -\")","v":""},24,null,null,"","","","","",null,"","","","","","",null,null,"","","",null,null,"","","","",24]
[null,null,null,null,null,"Select Pages to Print",null,null,null,null,null,null,null,null,null,null,null,"","","","",{"$f":"IF(OR(U30=\"\",ISBLANK($E$11)=TRUE),\"\",TRUNC((YEAR(Tables!$E$18)-YEAR(U30))+(MONTH(Tables!$E$18)-MONTH(U30))/12+0.92,0)-1+IF(AND(MONTH(Tables!$E$18)=MONTH(U30),DAY(U30)=1),1,0))","v":""},{"$f":"IFERROR(IF(T30=\"\",\"\",'Rating Formula'!J28),\"         -\")","v":""},25,null,null,"","","","","",null,"","","","","","",null,null,"","","",null,null,"","","","",25]
[null,null,null,null,null,"  Group Rate Summary",null,null,null,null,null,null,null,null,null,null,null,"","","","",{"$f":"IF(OR(U31=\"\",ISBLANK($E$11)=TRUE),\"\",TRUNC((YEAR(Tables!$E$18)-YEAR(U31))+(MONTH(Tables!$E$18)-MONTH(U31))/12+0.92,0)-1+IF(AND(MONTH(Tables!$E$18)=MONTH(U31),DAY(U31)=1),1,0))","v":""},{"$f":"IFERROR(IF(T31=\"\",\"\",'Rating Formula'!J29),\"         -\")","v":""},26,null,null,"","","","","",null,"","","","","","",null,null,"","","",null,null,"","","","",26]
[null,null,null,null,null,"  Age Rate Matrix",null,null,null,null,null,null,null,null,null,null,null,"","","","",{"$f":"IF(OR(U32=\"\",ISBLANK($E$11)=TRUE),\"\",TRUNC((YEAR(Tables!$E$18)-YEAR(U32))+(MONTH(Tables!$E$18)-MONTH(U32))/12+0.92,0)-1+IF(AND(MONTH(Tables!$E$18)=MONTH(U32),DAY(U32)=1),1,0))","v":""},{"$f":"IFERROR(IF(T32=\"\",\"\",'Rating Formula'!J30),\"         -\")","v":""},27,null,null,"","","","","",null,"","","","","","",null,null,"","","",null,null,"","","","",27]
[null,null,null,null,null,"  Alternates",null,null,null,null,null,null,null,null,null,null,null,"","","","",{"$f":"IF(OR(U33=\"\",ISBLANK($E$11)=TRUE),\"\",TRUNC((YEAR(Tables!$E$18)-YEAR(U33))+(MONTH(Tables!$E$18)-MONTH(U33))/12+0.92,0)-1+IF(AND(MONTH(Tables!$E$18)=MONTH(U33),DAY(U33)=1),1,0))","v":""},{"$f":"IFERROR(IF(T33=\"\",\"\",'Rating Formula'!J31),\"         -\")","v":""},28,null,null,"","","","","",null,"","","","","","",null,null,"","","",null,null,"","","","",28]
[null,null,null,null,null,null,null,null,null,null,null,null,null,null,null,null,null,"","","","",{"$f":"IF(OR(U34=\"\",ISBLANK($E$11)=TRUE),\"\",TRUNC((YEAR(Tables!$E$18)-YEAR(U34))+(MONTH(Tables!$E$18)-MONTH(U34))/12+0.92,0)-1+IF(AND(MONTH(Tables!$E$18)=MONTH(U34),DAY(U34)=1),1,0))","v":""},{"$f":"IFERROR(IF(T34=\"\",\"\",'Rating Formula'!J32),\"         -\")","v":""},29,null,null,"","","","","",null,"","","","","","",null,null,"","","",null,null,"","","","",29]
[null,null,null,null,null,null,null,null,null,null,null,null,null,null,null,null,null,"","","","",{"$f":"IF(OR(U35=\"\",ISBLANK($E$11)=TRUE),\"\",TRUNC((YEAR(Tables!$E$18)-YEAR(U35))+(MONTH(Tables!$E$18)-MONTH(U35))/12+0.92,0)-1+IF(AND(MONTH(Tables!$E$18)=MONTH(U35),DAY(U35)=1),1,0))","v":""},{"$f":"IFERROR(IF(T35=\"\",\"\",'Rating Formula'!J33),\"         -\")","v":""},30,null,null,"","","","","",null,"","","","","","",null,null,"","","",null,null,"","","","",30]
["*","Please note that premium rates may be changed on a quarterly basis.  To ensure accuracy,",null,null,null,null,null,null,null,null,null,null,null,null,null,null,null,"","","","",{"$f":"IF(OR(U36=\"\",ISBLANK($E$11)=TRUE),\"\",TRUNC((YEAR(Tables!$E$18)-YEAR(U36))+(MONTH(Tables!$E$18)-MONTH(U36))/12+0.92,0)-1+IF(AND(MONTH(Tables!$E$18)=MONTH(U36),DAY(U36)=1),1,0))","v":""},{"$f":"IFERROR(IF(T36=\"\",\"\",'Rating Formula'!J34),\"         -\")","v":""},31,null,null,"","","","","",null,"","","","","","",null,null,"","","",null,null,"","","","",31]
[null,"best practice is to use the most up to date rate calculator available on the WPS Health Solutions",null,null,null,null,null,null,null,null,null,null,null,null,null,null,null,"","","","",{"$f":"IF(OR(U37=\"\",ISBLANK($E$11)=TRUE),\"\",TRUNC((YEAR(Tables!$E$18)-YEAR(U37))+(MONTH(Tables!$E$18)-MONTH(U37))/12+0.92,0)-1+IF(AND(MONTH(Tables!$E$18)=MONTH(U37),DAY(U37)=1),1,0))","v":""},{"$f":"IFERROR(IF(T37=\"\",\"\",'Rating Formula'!J35),\"         -\")","v":""},32,null,null,"","","","","",null,"","","","","","",null,null,"","","",null,null,"","","","",32]
[null,"website:",null,{"$f":"HYPERLINK(\"https://www.wpshealth.com/resources/agent-resources/rate-calculators.shtml\",\"www.wpshealth.com\")","v":"www.wpshealth.com"},null,null,null,null,null,null,null,null,null,null,null,null,null,"","","","",{"$f":"IF(OR(U38=\"\",ISBLANK($E$11)=TRUE),\"\",TRUNC((YEAR(Tables!$E$18)-YEAR(U38))+(MONTH(Tables!$E$18)-MONTH(U38))/12+0.92,0)-1+IF(AND(MONTH(Tables!$E$18)=MONTH(U38),DAY(U38)=1),1,0))","v":""},{"$f":"IFERROR(IF(T38=\"\",\"\",'Rating Formula'!J36),\"         -\")","v":""},33,null,null,{"$f":"IF(ISNUMBER(R38)=TRUE,R38,\"\")","v":""},{"$f":"IF(ISNUMBER(R38)=TRUE,S38,\"\")","v":""},{"$f":"IF(ISNUMBER(R38)=TRUE,IF(T38=\"D\",IF(V38>20,\"Z\",\"Y\"),T38),\"\")","v":""},{"$f":"IF(ISNUMBER(R38)=TRUE,U38,\"\")","v":""},{"$f":"IF(ISNUMBER(R38)=TRUE,V38,\"\")","v":""},null,"","","","","","",null,null,"","","",null,null,{"$f":"R38&T38","v":""},{"$f":"V38","v":""},{"$f":"W38","v":""},{"$f":"IF(S38=0,\"\",S38)","v":""},33]
[null,null,null,null,null,null,null,null,null,null,null,null,null,null,null,null,null,"","","","",{"$f":"IF(OR(U39=\"\",ISBLANK($E$11)=TRUE),\"\",TRUNC((YEAR(Tables!$E$18)-YEAR(U39))+(MONTH(Tables!$E$18)-MONTH(U39))/12+0.92,0)-1+IF(AND(MONTH(Tables!$E$18)=MONTH(U39),DAY(U39)=1),1,0))","v":""},{"$f":"IFERROR(IF(T39=\"\",\"\",'Rating Formula'!J37),\"         -\")","v":""},34,null,null,"","","","","",null,"","","","","","",null,null,"","","",null,null,"","","","",34]
[null,null,null,null,null,null,null,null,null,null,null,null,null,null,null,null,null,"","","","",{"$f":"IF(OR(U40=\"\",ISBLANK($E$11)=TRUE),\"\",TRUNC((YEAR(Tables!$E$18)-YEAR(U40))+(MONTH(Tables!$E$18)-MONTH(U40))/12+0.92,0)-1+IF(AND(MONTH(Tables!$E$18)=MONTH(U40),DAY(U40)=1),1,0))","v":""},{"$f":"IFERROR(IF(T40=\"\",\"\",'Rating Formula'!J38),\"         -\")","v":""},35,null,null,"","","","","",null,"","","","","","",null,null,"","","",null,null,"","","","",35]
[null,null,null,null,null,null,null,null,null,null,null,null,null,null,null,null,null,"","","","",{"$f":"IF(OR(U41=\"\",ISBLANK($E$11)=TRUE),\"\",TRUNC((YEAR(Tables!$E$18)-YEAR(U41))+(MONTH(Tables!$E$18)-MONTH(U41))/12+0.92,0)-1+IF(AND(MONTH(Tables!$E$18)=MONTH(U41),DAY(U41)=1),1,0))","v":""},{"$f":"IFERROR(IF(T41=\"\",\"\",'Rating Formula'!J39),\"         -\")","v":""},36,null,null,"","","","","",null,"","","","","","",null,null,"","","",null,null,"","","","",36]
[null,null,null,null,null,null,null,null,null,null,null,null,null,null,null,null,null,"","","","",{"$f":"IF(OR(U42=\"\",ISBLANK($E$11)=TRUE),\"\",TRUNC((YEAR(Tables!$E$18)-YEAR(U42))+(MONTH(Tables!$E$18)-MONTH(U42))/12+0.92,0)-1+IF(AND(MONTH(Tables!$E$18)=MONTH(U42),DAY(U42)=1),1,0))","v":""},{"$f":"IFERROR(IF(T42=\"\",\"\",'Rating Formula'!J40),\"         -\")","v":""},37,null,null,"","","","","",null,"","","","","","",null,null,"","","",null,null,"","","","",37]
[null,null,null,null,null,null,null,null,null,null,null,null,null,null,null,null,null,"","","","",{"$f":"IF(OR(U43=\"\",ISBLANK($E$11)=TRUE),\"\",TRUNC((YEAR(Tables!$E$18)-YEAR(U43))+(MONTH(Tables!$E$18)-MONTH(U43))/12+0.92,0)-1+IF(AND(MONTH(Tables!$E$18)=MONTH(U43),DAY(U43)=1),1,0))","v":""},{"$f":"IFERROR(IF(T43=\"\",\"\",'Rating Formula'!J41),\"         -\")","v":""},38,null,null,"","","","","",null,"","","","","","",null,null,"","","",null,null,"","","","",38]
[null,null,null,null,null,null,null,null,null,null,null,null,null,null,null,null,null,"","","","",{"$f":"IF(OR(U44=\"\",ISBLANK($E$11)=TRUE),\"\",TRUNC((YEAR(Tables!$E$18)-YEAR(U44))+(MONTH(Tables!$E$18)-MONTH(U44))/12+0.92,0)-1+IF(AND(MONTH(Tables!$E$18)=MONTH(U44),DAY(U44)=1),1,0))","v":""},{"$f":"IFERROR(IF(T44=\"\",\"\",'Rating Formula'!J42),\"         -\")","v":""},39,null,null,"","","","","",null,"","","","","","",null,null,"","","",null,null,"","","","",39]
[null,null,null,null,null,null,null,null,null,null,null,null,null,null,null,null,null,"","","","",{"$f":"IF(OR(U45=\"\",ISBLANK($E$11)=TRUE),\"\",TRUNC((YEAR(Tables!$E$18)-YEAR(U45))+(MONTH(Tables!$E$18)-MONTH(U45))/12+0.92,0)-1+IF(AND(MONTH(Tables!$E$18)=MONTH(U45),DAY(U45)=1),1,0))","v":""},{"$f":"IFERROR(IF(T45=\"\",\"\",'Rating Formula'!J43),\"         -\")","v":""},40,null,null,"","","","","",null,"","","","","","",null,null,"","","",null,null,"","","","",40]
[null,null,null,null,null,null,null,null,null,null,null,null,null,null,null,null,null,"","","","",{"$f":"IF(OR(U46=\"\",ISBLANK($E$11)=TRUE),\"\",TRUNC((YEAR(Tables!$E$18)-YEAR(U46))+(MONTH(Tables!$E$18)-MONTH(U46))/12+0.92,0)-1+IF(AND(MONTH(Tables!$E$18)=MONTH(U46),DAY(U46)=1),1,0))","v":""},{"$f":"IFERROR(IF(T46=\"\",\"\",'Rating Formula'!J44),\"         -\")","v":""},41,null,null,"","","","","",null,"","","","","","",null,null,"","","",null,null,"","","","",41]
[null,null,null,null,null,null,null,null,null,null,null,null,null,null,null,null,null,"","","","",{"$f":"IF(OR(U47=\"\",ISBLANK($E$11)=TRUE),\"\",TRUNC((YEAR(Tables!$E$18)-YEAR(U47))+(MONTH(Tables!$E$18)-MONTH(U47))/12+0.92,0)-1+IF(AND(MONTH(Tables!$E$18)=MONTH(U47),DAY(U47)=1),1,0))","v":""},{"$f":"IFERROR(IF(T47=\"\",\"\",'Rating Formula'!J45),\"         -\")","v":""},42,null,null,"","","","","",null,"","","","","","",null,null,"","","",null,null,"","","","",42]
[null,null,null,null,null,null,null,null,null,null,null,null,null,null,null,null,null,"","","","",{"$f":"IF(OR(U48=\"\",ISBLANK($E$11)=TRUE),\"\",TRUNC((YEAR(Tables!$E$18)-YEAR(U48))+(MONTH(Tables!$E$18)-MONTH(U48))/12+0.92,0)-1+IF(AND(MONTH(Tables!$E$18)=MONTH(U48),DAY(U48)=1),1,0))","v":""},{"$f":"IFERROR(IF(T48=\"\",\"\",'Rating Formula'!J46),\"         -\")","v":""},43,null,null,"","","","","",null,"","","","","","",null,null,"","","",null,null,"","","","",43]
[null,null,null,null,null,null,null,null,null,null,null,null,null,null,null,null,null,"","","","",{"$f":"IF(OR(U49=\"\",ISBLANK($E$11)=TRUE),\"\",TRUNC((YEAR(Tables!$E$18)-YEAR(U49))+(MONTH(Tables!$E$18)-MONTH(U49))/12+0.92,0)-1+IF(AND(MONTH(Tables!$E$18)=MONTH(U49),DAY(U49)=1),1,0))","v":""},{"$f":"IFERROR(IF(T49=\"\",\"\",'Rating Formula'!J47),\"         -\")","v":""},44,null,null,"","","","","",null,"","","","","","",null,null,"","","",null,null,"","","","",44]
[null,null,null,null,null,null,null,null,null,null,null,null,null,null,null,null,null,"","","","",{"$f":"IF(OR(U50=\"\",ISBLANK($E$11)=TRUE),\"\",TRUNC((YEAR(Tables!$E$18)-YEAR(U50))+(MONTH(Tables!$E$18)-MONTH(U50))/12+0.92,0)-1+IF(AND(MONTH(Tables!$E$18)=MONTH(U50),DAY(U50)=1),1,0))","v":""},{"$f":"IFERROR(IF(T50=\"\",\"\",'Rating Formula'!J48),\"         -\")","v":""},45,null,null,"","","","","",null,"","","","","","",null,null,"","","",null,null,"","","","",45]
[null,null,null,null,null,null,null,null,null,null,null,null,null,null,null,null,null,"","","","",{"$f":"IF(OR(U51=\"\",ISBLANK($E$11)=TRUE),\"\",TRUNC((YEAR(Tables!$E$18)-YEAR(U51))+(MONTH(Tables!$E$18)-MONTH(U51))/12+0.92,0)-1+IF(AND(MONTH(Tables!$E$18)=MONTH(U51),DAY(U51)=1),1,0))","v":""},{"$f":"IFERROR(IF(T51=\"\",\"\",'Rating Formula'!J49),\"         -\")","v":""},46,null,null,"","","","","",null,"","","","","","",null,null,"","","",null,null,"","","","",46]
[null,null,null,null,null,null,null,null,null,null,null,null,null,null,null,null,null,"","","","",{"$f":"IF(OR(U52=\"\",ISBLANK($E$11)=TRUE),\"\",TRUNC((YEAR(Tables!$E$18)-YEAR(U52))+(MONTH(Tables!$E$18)-MONTH(U52))/12+0.92,0)-1+IF(AND(MONTH(Tables!$E$18)=MONTH(U52),DAY(U52)=1),1,0))","v":""},{"$f":"IFERROR(IF(T52=\"\",\"\",'Rating Formula'!J50),\"         -\")","v":""},47,null,null,"","","","","",null,"","","","","","",null,null,"","","",null,null,"","","","",47]
[null,null,null,null,null,null,null,null,null,null,null,null,null,null,null,null,null,"","","","",{"$f":"IF(OR(U53=\"\",ISBLANK($E$11)=TRUE),\"\",TRUNC((YEAR(Tables!$E$18)-YEAR(U53))+(MONTH(Tables!$E$18)-MONTH(U53))/12+0.92,0)-1+IF(AND(MONTH(Tables!$E$18)=MONTH(U53),DAY(U53)=1),1,0))","v":""},{"$f":"IFERROR(IF(T53=\"\",\"\",'Rating Formula'!J51),\"         -\")","v":""},48,null,null,"","","","","",null,"","","","","","",null,null,"","","",null,null,"","","","",48]
[null,null,null,null,null,null,null,null,null,null,null,null,null,null,null,null,null,"","","","",{"$f":"IF(OR(U54=\"\",ISBLANK($E$11)=TRUE),\"\",TRUNC((YEAR(Tables!$E$18)-YEAR(U54))+(MONTH(Tables!$E$18)-MONTH(U54))/12+0.92,0)-1+IF(AND(MONTH(Tables!$E$18)=MONTH(U54),DAY(U54)=1),1,0))","v":""},{"$f":"IFERROR(IF(T54=\"\",\"\",'Rating Formula'!J52),\"         -\")","v":""},49,null,null,"","","","","",null,"","","","","","",null,null,"","","",null,null,"","","","",49]
[null,null,null,null,null,null,null,null,null,null,null,null,null,null,null,null,null,"","","","",{"$f":"IF(OR(U55=\"\",ISBLANK($E$11)=TRUE),\"\",TRUNC((YEAR(Tables!$E$18)-YEAR(U55))+(MONTH(Tables!$E$18)-MONTH(U55))/12+0.92,0)-1+IF(AND(MONTH(Tables!$E$18)=MONTH(U55),DAY(U55)=1),1,0))","v":""},{"$f":"IFERROR(IF(T55=\"\",\"\",'Rating Formula'!J53),\"         -\")","v":""},50,null,null,"","","","","",null,"","","","","","",null,null,"","","",null,null,"","","","",50]
[null,null,null,null,null,null,null,null,null,null,null,null,null,null,null,null,null,"","","","",{"$f":"IF(OR(U56=\"\",ISBLANK($E$11)=TRUE),\"\",TRUNC((YEAR(Tables!$E$18)-YEAR(U56))+(MONTH(Tables!$E$18)-MONTH(U56))/12+0.92,0)-1+IF(AND(MONTH(Tables!$E$18)=MONTH(U56),DAY(U56)=1),1,0))","v":""},{"$f":"IFERROR(IF(T56=\"\",\"\",'Rating Formula'!J54),\"         -\")","v":""},51,null,null,"","","","","",null,"","","","","","",null,null,"","","",null,null,"","","","",51]
[null,null,null,null,null,null,null,null,null,null,null,null,null,null,null,null,null,"","","","",{"$f":"IF(OR(U57=\"\",ISBLANK($E$11)=TRUE),\"\",TRUNC((YEAR(Tables!$E$18)-YEAR(U57))+(MONTH(Tables!$E$18)-MONTH(U57))/12+0.92,0)-1+IF(AND(MONTH(Tables!$E$18)=MONTH(U57),DAY(U57)=1),1,0))","v":""},{"$f":"IFERROR(IF(T57=\"\",\"\",'Rating Formula'!J55),\"         -\")","v":""},52,null,null,"","","","","",null,"","","","","","",null,null,"","","",null,null,"","","","",52]
[null,null,null,null,null,null,null,null,null,null,null,null,null,null,null,null,null,"","","","",{"$f":"IF(OR(U58=\"\",ISBLANK($E$11)=TRUE),\"\",TRUNC((YEAR(Tables!$E$18)-YEAR(U58))+(MONTH(Tables!$E$18)-MONTH(U58))/12+0.92,0)-1+IF(AND(MONTH(Tables!$E$18)=MONTH(U58),DAY(U58)=1),1,0))","v":""},{"$f":"IFERROR(IF(T58=\"\",\"\",'Rating Formula'!J56),\"         -\")","v":""},53,null,null,"","","","","",null,"","","","","","",null,null,"","","",null,null,"","","","",53]
[null,null,null,null,null,null,null,null,null,null,null,null,null,null,null,null,null,"","","","",{"$f":"IF(OR(U59=\"\",ISBLANK($E$11)=TRUE),\"\",TRUNC((YEAR(Tables!$E$18)-YEAR(U59))+(MONTH(Tables!$E$18)-MONTH(U59))/12+0.92,0)-1+IF(AND(MONTH(Tables!$E$18)=MONTH(U59),DAY(U59)=1),1,0))","v":""},{"$f":"IFERROR(IF(T59=\"\",\"\",'Rating Formula'!J57),\"         -\")","v":""},54,null,null,"","","","","",null,"","","","","","",null,null,"","","",null,null,"","","","",54]
[null,null,null,null,null,null,null,null,null,null,null,null,null,null,null,null,null,"","","","",{"$f":"IF(OR(U60=\"\",ISBLANK($E$11)=TRUE),\"\",TRUNC((YEAR(Tables!$E$18)-YEAR(U60))+(MONTH(Tables!$E$18)-MONTH(U60))/12+0.92,0)-1+IF(AND(MONTH(Tables!$E$18)=MONTH(U60),DAY(U60)=1),1,0))","v":""},{"$f":"IFERROR(IF(T60=\"\",\"\",'Rating Formula'!J58),\"         -\")","v":""},55,null,null,"","","","","",null,"","","","","","",null,null,"","","",null,null,"","","","",55]
[null,null,null,null,null,null,null,null,null,null,null,null,null,null,null,null,null,"","","","",{"$f":"IF(OR(U61=\"\",ISBLANK($E$11)=TRUE),\"\",TRUNC((YEAR(Tables!$E$18)-YEAR(U61))+(MONTH(Tables!$E$18)-MONTH(U61))/12+0.92,0)-1+IF(AND(MONTH(Tables!$E$18)=MONTH(U61),DAY(U61)=1),1,0))","v":""},{"$f":"IFERROR(IF(T61=\"\",\"\",'Rating Formula'!J59),\"         -\")","v":""},56,null,null,"","","","","",null,"","","","","","",null,null,"","","",null,null,"","","","",56]
[null,null,null,null,null,null,null,null,null,null,null,null,null,null,null,null,null,"","","","",{"$f":"IF(OR(U62=\"\",ISBLANK($E$11)=TRUE),\"\",TRUNC((YEAR(Tables!$E$18)-YEAR(U62))+(MONTH(Tables!$E$18)-MONTH(U62))/12+0.92,0)-1+IF(AND(MONTH(Tables!$E$18)=MONTH(U62),DAY(U62)=1),1,0))","v":""},{"$f":"IFERROR(IF(T62=\"\",\"\",'Rating Formula'!J60),\"         -\")","v":""},57,null,null,"","","","","",null,"","","","","","",null,null,"","","",null,null,"","","","",57]
[null,null,null,null,null,null,null,null,null,null,null,null,null,null,null,null,null,"","","","",{"$f":"IF(OR(U63=\"\",ISBLANK($E$11)=TRUE),\"\",TRUNC((YEAR(Tables!$E$18)-YEAR(U63))+(MONTH(Tables!$E$18)-MONTH(U63))/12+0.92,0)-1+IF(AND(MONTH(Tables!$E$18)=MONTH(U63),DAY(U63)=1),1,0))","v":""},{"$f":"IFERROR(IF(T63=\"\",\"\",'Rating Formula'!J61),\"         -\")","v":""},58,null,null,"","","","","",null,"","","","","","",null,null,"","","",null,null,"","","","",58]
[null,null,null,null,null,null,null,null,null,null,null,null,null,null,null,null,null,"","","","",{"$f":"IF(OR(U64=\"\",ISBLANK($E$11)=TRUE),\"\",TRUNC((YEAR(Tables!$E$18)-YEAR(U64))+(MONTH(Tables!$E$18)-MONTH(U64))/12+0.92,0)-1+IF(AND(MONTH(Tables!$E$18)=MONTH(U64),DAY(U64)=1),1,0))","v":""},{"$f":"IFERROR(IF(T64=\"\",\"\",'Rating Formula'!J62),\"         -\")","v":""},59,null,null,"","","","","",null,"","","","","","",null,null,"","","",null,null,"","","","",59]
[null,null,null,null,null,null,null,null,null,null,null,null,null,null,null,null,null,"","","","",{"$f":"IF(OR(U65=\"\",ISBLANK($E$11)=TRUE),\"\",TRUNC((YEAR(Tables!$E$18)-YEAR(U65))+(MONTH(Tables!$E$18)-MONTH(U65))/12+0.92,0)-1+IF(AND(MONTH(Tables!$E$18)=MONTH(U65),DAY(U65)=1),1,0))","v":""},{"$f":"IFERROR(IF(T65=\"\",\"\",'Rating Formula'!J63),\"         -\")","v":""},60,null,null,"","","","","",null,"","","","","","",null,null,"","","",null,null,"","","","",60]
[null,null,null,null,null,null,null,null,null,null,null,null,null,null,null,null,null,"","","","",{"$f":"IF(OR(U66=\"\",ISBLANK($E$11)=TRUE),\"\",TRUNC((YEAR(Tables!$E$18)-YEAR(U66))+(MONTH(Tables!$E$18)-MONTH(U66))/12+0.92,0)-1+IF(AND(MONTH(Tables!$E$18)=MONTH(U66),DAY(U66)=1),1,0))","v":""},{"$f":"IFERROR(IF(T66=\"\",\"\",'Rating Formula'!J64),\"         -\")","v":""},61,null,null,"","","","","",null,"","","","","","",null,null,"","","",null,null,"","","","",61]
[null,null,null,null,null,null,null,null,null,null,null,null,null,null,null,null,null,"","","","",{"$f":"IF(OR(U67=\"\",ISBLANK($E$11)=TRUE),\"\",TRUNC((YEAR(Tables!$E$18)-YEAR(U67))+(MONTH(Tables!$E$18)-MONTH(U67))/12+0.92,0)-1+IF(AND(MONTH(Tables!$E$18)=MONTH(U67),DAY(U67)=1),1,0))","v":""},{"$f":"IFERROR(IF(T67=\"\",\"\",'Rating Formula'!J65),\"         -\")","v":""},62,null,null,"","","","","",null,"","","","","","",null,null,"","","",null,null,"","","","",62]
[null,null,null,null,null,null,null,null,null,null,null,null,null,null,null,null,null,"","","","",{"$f":"IF(OR(U68=\"\",ISBLANK($E$11)=TRUE),\"\",TRUNC((YEAR(Tables!$E$18)-YEAR(U68))+(MONTH(Tables!$E$18)-MONTH(U68))/12+0.92,0)-1+IF(AND(MONTH(Tables!$E$18)=MONTH(U68),DAY(U68)=1),1,0))","v":""},{"$f":"IFERROR(IF(T68=\"\",\"\",'Rating Formula'!J66),\"         -\")","v":""},63,null,null,"","","","","",null,"","","","","","",null,null,"","","",null,null,"","","","",63]
[null,null,null,null,null,null,null,null,null,null,null,null,null,null,null,null,null,"","","","",{"$f":"IF(OR(U69=\"\",ISBLANK($E$11)=TRUE),\"\",TRUNC((YEAR(Tables!$E$18)-YEAR(U69))+(MONTH(Tables!$E$18)-MONTH(U69))/12+0.92,0)-1+IF(AND(MONTH(Tables!$E$18)=MONTH(U69),DAY(U69)=1),1,0))","v":""},{"$f":"IFERROR(IF(T69=\"\",\"\",'Rating Formula'!J67),\"         -\")","v":""},64,null,null,"","","","","",null,"","","","","","",null,null,"","","",null,null,"","","","",64]
[null,null,null,null,null,null,null,null,null,null,null,null,null,null,null,null,null,"","","","",{"$f":"IF(OR(U70=\"\",ISBLANK($E$11)=TRUE),\"\",TRUNC((YEAR(Tables!$E$18)-YEAR(U70))+(MONTH(Tables!$E$18)-MONTH(U70))/12+0.92,0)-1+IF(AND(MONTH(Tables!$E$18)=MONTH(U70),DAY(U70)=1),1,0))","v":""},{"$f":"IFERROR(IF(T70=\"\",\"\",'Rating Formula'!J68),\"         -\")","v":""},65,null,null,{"$f":"IF(ISNUMBER(R70)=TRUE,R70,\"\")","v":""},{"$f":"IF(ISNUMBER(R70)=TRUE,S70,\"\")","v":""},{"$f":"IF(ISNUMBER(R70)=TRUE,IF(T70=\"D\",IF(V70>20,\"Z\",\"Y\"),T70),\"\")","v":""},{"$f":"IF(ISNUMBER(R70)=TRUE,U70,\"\")","v":""},{"$f":"IF(ISNUMBER(R70)=TRUE,V70,\"\")","v":""},null,{"$f":"IF(AH70=\"\",\"\",IF(AJ70=\"Y\",AG69+1,0))","v":""},"","","","","",null,null,"","","",null,null,{"$f":"R70&T70","v":""},{"$f":"V70","v":""},{"$f":"W70","v":""},{"$f":"IF(S70=0,\"\",S70)","v":""},65]
[null,null,null,null,null,null,null,null,null,null,null,null,null,null,null,null,null,"","","","",{"$f":"IF(OR(U71=\"\",ISBLANK($E$11)=TRUE),\"\",TRUNC((YEAR(Tables!$E$18)-YEAR(U71))+(MONTH(Tables!$E$18)-MONTH(U71))/12+0.92,0)-1+IF(AND(MONTH(Tables!$E$18)=MONTH(U71),DAY(U71)=1),1,0))","v":""},{"$f":"IFERROR(IF(T71=\"\",\"\",'Rating Formula'!J69),\"         -\")","v":""},66,null,null,"","","","","",null,"","","","","","",null,null,{"$f":"IF(AI71=\"\",\"\",AI71)","v":""},"",{"$f":"IF(AK71=\"\",\"\",AK71)","v":""},null,null,"","","","",66]
[null,null,null,null,null,null,null,null,null,null,null,null,null,null,null,null,null,"","","","",{"$f":"IF(OR(U72=\"\",ISBLANK($E$11)=TRUE),\"\",TRUNC((YEAR(Tables!$E$18)-YEAR(U72))+(MONTH(Tables!$E$18)-MONTH(U72))/12+0.92,0)-1+IF(AND(MONTH(Tables!$E$18)=MONTH(U72),DAY(U72)=1),1,0))","v":""},{"$f":"IFERROR(IF(T72=\"\",\"\",'Rating Formula'!J70),\"         -\")","v":""},67,null,null,"","","","","",null,"","","","","","",null,null,"",{"$f":"IF(OR(AJ72=\"Y\",AJ72=\"Z\"),\"D\",UPPER(AJ72))","v":""},"",null,null,"","","","",{"$f":"1+AX71","v":67}]
[null,null,null,null,null,null,null,null,null,null,null,null,null,null,null,null,null,"","","","",{"$f":"IF(OR(U73=\"\",ISBLANK($E$11)=TRUE),\"\",TRUNC((YEAR(Tables!$E$18)-YEAR(U73))+(MONTH(Tables!$E$18)-MONTH(U73))/12+0.92,0)-1+IF(AND(MONTH(Tables!$E$18)=MONTH(U73),DAY(U73)=1),1,0))","v":""},{"$f":"IFERROR(IF(T73=\"\",\"\",'Rating Formula'!J71),\"         -\")","v":""},68,null,null,"","","","","",null,"","","","","","",null,null,"","","",null,null,"","","","",68]
[null,null,null,null,null,null,null,null,null,null,null,null,null,null,null,null,null,"","","","",{"$f":"IF(OR(U74=\"\",ISBLANK($E$11)=TRUE),\"\",TRUNC((YEAR(Tables!$E$18)-YEAR(U74))+(MONTH(Tables!$E$18)-MONTH(U74))/12+0.92,0)-1+IF(AND(MONTH(Tables!$E$18)=MONTH(U74),DAY(U74)=1),1,0))","v":""},{"$f":"IFERROR(IF(T74=\"\",\"\",'Rating Formula'!J72),\"         -\")","v":""},69,null,null,"","","","","",null,"","","","","","",null,null,"","","",null,null,"","","","",69]
[null,null,null,null,null,null,null,null,null,null,null,null,null,null,null,null,null,"","","","",{"$f":"IF(OR(U75=\"\",ISBLANK($E$11)=TRUE),\"\",TRUNC((YEAR(Tables!$E$18)-YEAR(U75))+(MONTH(Tables!$E$18)-MONTH(U75))/12+0.92,0)-1+IF(AND(MONTH(Tables!$E$18)=MONTH(U75),DAY(U75)=1),1,0))","v":""},{"$f":"IFERROR(IF(T75=\"\",\"\",'Rating Formula'!J73),\"         -\")","v":""},70,null,null,"","","","","",null,"","","","","","",null,null,"","","",null,null,"","","","",70]
[null,null,null,null,null,null,null,null,null,null,null,null,null,null,null,null,null,"","","","",{"$f":"IF(OR(U76=\"\",ISBLANK($E$11)=TRUE),\"\",TRUNC((YEAR(Tables!$E$18)-YEAR(U76))+(MONTH(Tables!$E$18)-MONTH(U76))/12+0.92,0)-1+IF(AND(MONTH(Tables!$E$18)=MONTH(U76),DAY(U76)=1),1,0))","v":""},{"$f":"IFERROR(IF(T76=\"\",\"\",'Rating Formula'!J74),\"         -\")","v":""},71,null,null,"","","","","",null,"","","","","","",null,null,"","","",null,null,"","","","",71]
[null,null,null,null,null,null,null,null,null,null,null,null,null,null,null,null,null,"","","","",{"$f":"IF(OR(U77=\"\",ISBLANK($E$11)=TRUE),\"\",TRUNC((YEAR(Tables!$E$18)-YEAR(U77))+(MONTH(Tables!$E$18)-MONTH(U77))/12+0.92,0)-1+IF(AND(MONTH(Tables!$E$18)=MONTH(U77),DAY(U77)=1),1,0))","v":""},{"$f":"IFERROR(IF(T77=\"\",\"\",'Rating Formula'!J75),\"         -\")","v":""},72,null,null,"","","","","",null,"","","","","","",null,null,"","","",null,null,"","","","",72]
[null,null,null,null,null,null,null,null,null,null,null,null,null,null,null,null,null,"","","","",{"$f":"IF(OR(U78=\"\",ISBLANK($E$11)=TRUE),\"\",TRUNC((YEAR(Tables!$E$18)-YEAR(U78))+(MONTH(Tables!$E$18)-MONTH(U78))/12+0.92,0)-1+IF(AND(MONTH(Tables!$E$18)=MONTH(U78),DAY(U78)=1),1,0))","v":""},{"$f":"IFERROR(IF(T78=\"\",\"\",'Rating Formula'!J76),\"         -\")","v":""},73,null,null,"","","","","",null,"","","","","","",null,null,"","","",null,null,"","","","",73]
[null,null,null,null,null,null,null,null,null,null,null,null,null,null,null,null,null,"","","","",{"$f":"IF(OR(U79=\"\",ISBLANK($E$11)=TRUE),\"\",TRUNC((YEAR(Tables!$E$18)-YEAR(U79))+(MONTH(Tables!$E$18)-MONTH(U79))/12+0.92,0)-1+IF(AND(MONTH(Tables!$E$18)=MONTH(U79),DAY(U79)=1),1,0))","v":""},{"$f":"IFERROR(IF(T79=\"\",\"\",'Rating Formula'!J77),\"         -\")","v":""},74,null,null,"","","","","",null,"","","","","","",null,null,"","","",null,null,"","","","",74]
[null,null,null,null,null,null,null,null,null,null,null,null,null,null,null,null,null,"","","","",{"$f":"IF(OR(U80=\"\",ISBLANK($E$11)=TRUE),\"\",TRUNC((YEAR(Tables!$E$18)-YEAR(U80))+(MONTH(Tables!$E$18)-MONTH(U80))/12+0.92,0)-1+IF(AND(MONTH(Tables!$E$18)=MONTH(U80),DAY(U80)=1),1,0))","v":""},{"$f":"IFERROR(IF(T80=\"\",\"\",'Rating Formula'!J78),\"         -\")","v":""},75,null,null,"","","","","",null,"","","","","","",null,null,"","","",null,null,"","","","",75]
[null,null,null,null,null,null,null,null,null,null,null,null,null,null,null,null,null,"","","","",{"$f":"IF(OR(U81=\"\",ISBLANK($E$11)=TRUE),\"\",TRUNC((YEAR(Tables!$E$18)-YEAR(U81))+(MONTH(Tables!$E$18)-MONTH(U81))/12+0.92,0)-1+IF(AND(MONTH(Tables!$E$18)=MONTH(U81),DAY(U81)=1),1,0))","v":""},{"$f":"IFERROR(IF(T81=\"\",\"\",'Rating Formula'!J79),\"         -\")","v":""},76,null,null,"","","","","",null,"","","","","","",null,null,"","","",null,null,"","","","",76]
[null,null,null,null,null,null,null,null,null,null,null,null,null,null,null,null,null,"","","","",{"$f":"IF(OR(U82=\"\",ISBLANK($E$11)=TRUE),\"\",TRUNC((YEAR(Tables!$E$18)-YEAR(U82))+(MONTH(Tables!$E$18)-MONTH(U82))/12+0.92,0)-1+IF(AND(MONTH(Tables!$E$18)=MONTH(U82),DAY(U82)=1),1,0))","v":""},{"$f":"IFERROR(IF(T82=\"\",\"\",'Rating Formula'!J80),\"         -\")","v":""},77,null,null,"","","","","",null,"","","","","","",null,null,"","","",null,null,"","","","",77]
[null,null,null,null,null,null,null,null,null,null,null,null,null,null,null,null,null,"","","","",{"$f":"IF(OR(U83=\"\",ISBLANK($E$11)=TRUE),\"\",TRUNC((YEAR(Tables!$E$18)-YEAR(U83))+(MONTH(Tables!$E$18)-MONTH(U83))/12+0.92,0)-1+IF(AND(MONTH(Tables!$E$18)=MONTH(U83),DAY(U83)=1),1,0))","v":""},{"$f":"IFERROR(IF(T83=\"\",\"\",'Rating Formula'!J81),\"         -\")","v":""},78,null,null,"","","","","",null,"","","","","","",null,null,"","","",null,null,"","","","",78]
[null,null,null,null,null,null,null,null,null,null,null,null,null,null,null,null,null,{"$f":"IF(T84=\"\",\"\",IF(T84=\"E\",R83+1,R83))","v":""},"","","",{"$f":"IF(OR(U84=\"\",ISBLANK($E$11)=TRUE),\"\",TRUNC((YEAR(Tables!$E$18)-YEAR(U84))+(MONTH(Tables!$E$18)-MONTH(U84))/12+0.92,0)-1+IF(AND(MONTH(Tables!$E$18)=MONTH(U84),DAY(U84)=1),1,0))","v":""},{"$f":"IFERROR(IF(T84=\"\",\"\",'Rating Formula'!J82),\"         -\")","v":""},79,null,null,"","","","","",null,"","","","","","",null,null,"","","",null,null,"","","","",79]
[null,null,null,null,null,null,null,null,null,null,null,null,null,null,null,null,null,"","","","",{"$f":"IF(OR(U85=\"\",ISBLANK($E$11)=TRUE),\"\",TRUNC((YEAR(Tables!$E$18)-YEAR(U85))+(MONTH(Tables!$E$18)-MONTH(U85))/12+0.92,0)-1+IF(AND(MONTH(Tables!$E$18)=MONTH(U85),DAY(U85)=1),1,0))","v":""},{"$f":"IFERROR(IF(T85=\"\",\"\",'Rating Formula'!J83),\"         -\")","v":""},80,null,null,"","","","","",null,"","","","","","",null,null,"","","",null,null,"","","","",80]
[null,null,null,null,null,null,null,null,null,null,null,null,null,null,null,null,null,"","","","",{"$f":"IF(OR(U86=\"\",ISBLANK($E$11)=TRUE),\"\",TRUNC((YEAR(Tables!$E$18)-YEAR(U86))+(MONTH(Tables!$E$18)-MONTH(U86))/12+0.92,0)-1+IF(AND(MONTH(Tables!$E$18)=MONTH(U86),DAY(U86)=1),1,0))","v":""},{"$f":"IFERROR(IF(T86=\"\",\"\",'Rating Formula'!J84),\"         -\")","v":""},81,null,null,"","","","","",null,"","","","","","",null,null,"","","",null,null,"","","","",81]
[null,null,null,null,null,null,null,null,null,null,null,null,null,null,null,null,null,"","","","",{"$f":"IF(OR(U87=\"\",ISBLANK($E$11)=TRUE),\"\",TRUNC((YEAR(Tables!$E$18)-YEAR(U87))+(MONTH(Tables!$E$18)-MONTH(U87))/12+0.92,0)-1+IF(AND(MONTH(Tables!$E$18)=MONTH(U87),DAY(U87)=1),1,0))","v":""},{"$f":"IFERROR(IF(T87=\"\",\"\",'Rating Formula'!J85),\"         -\")","v":""},82,null,null,"","","","","",null,"","","","","","",null,null,"","","",null,null,"","","","",82]
[null,null,null,null,null,null,null,null,null,null,null,null,null,null,null,null,null,"","","","",{"$f":"IF(OR(U88=\"\",ISBLANK($E$11)=TRUE),\"\",TRUNC((YEAR(Tables!$E$18)-YEAR(U88))+(MONTH(Tables!$E$18)-MONTH(U88))/12+0.92,0)-1+IF(AND(MONTH(Tables!$E$18)=MONTH(U88),DAY(U88)=1),1,0))","v":""},{"$f":"IFERROR(IF(T88=\"\",\"\",'Rating Formula'!J86),\"         -\")","v":""},83,null,null,"","","","","",null,"","","","","","",null,null,"","","",null,null,"","","","",83]
[null,null,null,null,null,null,null,null,null,null,null,null,null,null,null,null,null,"","","","",{"$f":"IF(OR(U89=\"\",ISBLANK($E$11)=TRUE),\"\",TRUNC((YEAR(Tables!$E$18)-YEAR(U89))+(MONTH(Tables!$E$18)-MONTH(U89))/12+0.92,0)-1+IF(AND(MONTH(Tables!$E$18)=MONTH(U89),DAY(U89)=1),1,0))","v":""},{"$f":"IFERROR(IF(T89=\"\",\"\",'Rating Formula'!J87),\"         -\")","v":""},84,null,null,"","","","","",null,"","","","","","",null,null,"","","",null,null,"","","","",84]
[null,null,null,null,null,null,null,null,null,null,null,null,null,null,null,null,null,"","","","",{"$f":"IF(OR(U90=\"\",ISBLANK($E$11)=TRUE),\"\",TRUNC((YEAR(Tables!$E$18)-YEAR(U90))+(MONTH(Tables!$E$18)-MONTH(U90))/12+0.92,0)-1+IF(AND(MONTH(Tables!$E$18)=MONTH(U90),DAY(U90)=1),1,0))","v":""},{"$f":"IFERROR(IF(T90=\"\",\"\",'Rating Formula'!J88),\"         -\")","v":""},85,null,null,"","","","","",null,"","","","","","",null,null,"","","",null,null,"","","","",85]
[null,null,null,null,null,null,null,null,null,null,null,null,null,null,null,null,null,"","","","",{"$f":"IF(OR(U91=\"\",ISBLANK($E$11)=TRUE),\"\",TRUNC((YEAR(Tables!$E$18)-YEAR(U91))+(MONTH(Tables!$E$18)-MONTH(U91))/12+0.92,0)-1+IF(AND(MONTH(Tables!$E$18)=MONTH(U91),DAY(U91)=1),1,0))","v":""},{"$f":"IFERROR(IF(T91=\"\",\"\",'Rating Formula'!J89),\"         -\")","v":""},86,null,null,"","","","","",null,"","","","","","",null,null,"","","",null,null,"","","","",86]
[null,null,null,null,null,null,null,null,null,null,null,null,null,null,null,null,null,"","","","",{"$f":"IF(OR(U92=\"\",ISBLANK($E$11)=TRUE),\"\",TRUNC((YEAR(Tables!$E$18)-YEAR(U92))+(MONTH(Tables!$E$18)-MONTH(U92))/12+0.92,0)-1+IF(AND(MONTH(Tables!$E$18)=MONTH(U92),DAY(U92)=1),1,0))","v":""},{"$f":"IFERROR(IF(T92=\"\",\"\",'Rating Formula'!J90),\"         -\")","v":""},87,null,null,"","","","","",null,"","","","","","",null,null,"","","",null,null,"","","","",87]
[null,null,null,null,null,null,null,null,null,null,null,null,null,null,null,null,null,"","","","",{"$f":"IF(OR(U93=\"\",ISBLANK($E$11)=TRUE),\"\",TRUNC((YEAR(Tables!$E$18)-YEAR(U93))+(MONTH(Tables!$E$18)-MONTH(U93))/12+0.92,0)-1+IF(AND(MONTH(Tables!$E$18)=MONTH(U93),DAY(U93)=1),1,0))","v":""},{"$f":"IFERROR(IF(T93=\"\",\"\",'Rating Formula'!J91),\"         -\")","v":""},88,null,null,"","","","","",null,"","","","","","",null,null,"","","",null,null,"","","","",88]
[null,null,null,null,null,null,null,null,null,null,null,null,null,null,null,null,null,"","","","",{"$f":"IF(OR(U94=\"\",ISBLANK($E$11)=TRUE),\"\",TRUNC((YEAR(Tables!$E$18)-YEAR(U94))+(MONTH(Tables!$E$18)-MONTH(U94))/12+0.92,0)-1+IF(AND(MONTH(Tables!$E$18)=MONTH(U94),DAY(U94)=1),1,0))","v":""},{"$f":"IFERROR(IF(T94=\"\",\"\",'Rating Formula'!J92),\"         -\")","v":""},89,null,null,"","","","","",null,"","","","","","",null,null,"","","",null,null,"","","","",89]
[null,null,null,null,null,null,null,null,null,null,null,null,null,null,null,null,null,"","","","",{"$f":"IF(OR(U95=\"\",ISBLANK($E$11)=TRUE),\"\",TRUNC((YEAR(Tables!$E$18)-YEAR(U95))+(MONTH(Tables!$E$18)-MONTH(U95))/12+0.92,0)-1+IF(AND(MONTH(Tables!$E$18)=MONTH(U95),DAY(U95)=1),1,0))","v":""},{"$f":"IFERROR(IF(T95=\"\",\"\",'Rating Formula'!J93),\"         -\")","v":""},90,null,null,"","","","","",null,"","","","","","",null,null,"","","",null,null,"","","","",90]
[null,null,null,null,null,null,null,null,null,null,null,null,null,null,null,null,null,"","","","",{"$f":"IF(OR(U96=\"\",ISBLANK($E$11)=TRUE),\"\",TRUNC((YEAR(Tables!$E$18)-YEAR(U96))+(MONTH(Tables!$E$18)-MONTH(U96))/12+0.92,0)-1+IF(AND(MONTH(Tables!$E$18)=MONTH(U96),DAY(U96)=1),1,0))","v":""},{"$f":"IFERROR(IF(T96=\"\",\"\",'Rating Formula'!J94),\"         -\")","v":""},91,null,null,"","","","","",null,"","","","","","",null,null,"","","",null,null,"","","","",91]
[null,null,null,null,null,null,null,null,null,null,null,null,null,null,null,null,null,"","","","",{"$f":"IF(OR(U97=\"\",ISBLANK($E$11)=TRUE),\"\",TRUNC((YEAR(Tables!$E$18)-YEAR(U97))+(MONTH(Tables!$E$18)-MONTH(U97))/12+0.92,0)-1+IF(AND(MONTH(Tables!$E$18)=MONTH(U97),DAY(U97)=1),1,0))","v":""},{"$f":"IFERROR(IF(T97=\"\",\"\",'Rating Formula'!J95),\"         -\")","v":""},92,null,null,"","","","","",null,"","","","","","",null,null,"","","",null,null,"","","","",92]
[null,null,null,null,null,null,null,null,null,null,null,null,null,null,null,null,null,"","","","",{"$f":"IF(OR(U98=\"\",ISBLANK($E$11)=TRUE),\"\",TRUNC((YEAR(Tables!$E$18)-YEAR(U98))+(MONTH(Tables!$E$18)-MONTH(U98))/12+0.92,0)-1+IF(AND(MONTH(Tables!$E$18)=MONTH(U98),DAY(U98)=1),1,0))","v":""},{"$f":"IFERROR(IF(T98=\"\",\"\",'Rating Formula'!J96),\"         -\")","v":""},93,null,null,"","","","","",null,"","","","","","",null,null,"","","",null,null,"","","","",93]
[null,null,null,null,null,null,null,null,null,null,null,null,null,null,null,null,null,"","","","",{"$f":"IF(OR(U99=\"\",ISBLANK($E$11)=TRUE),\"\",TRUNC((YEAR(Tables!$E$18)-YEAR(U99))+(MONTH(Tables!$E$18)-MONTH(U99))/12+0.92,0)-1+IF(AND(MONTH(Tables!$E$18)=MONTH(U99),DAY(U99)=1),1,0))","v":""},{"$f":"IFERROR(IF(T99=\"\",\"\",'Rating Formula'!J97),\"         -\")","v":""},94,null,null,"","","","","",null,"","","","","","",null,null,"","","",null,null,"","","","",94]
[null,null,null,null,null,null,null,null,null,null,null,null,null,null,null,null,null,"","","","",{"$f":"IF(OR(U100=\"\",ISBLANK($E$11)=TRUE),\"\",TRUNC((YEAR(Tables!$E$18)-YEAR(U100))+(MONTH(Tables!$E$18)-MONTH(U100))/12+0.92,0)-1+IF(AND(MONTH(Tables!$E$18)=MONTH(U100),DAY(U100)=1),1,0))","v":""},{"$f":"IFERROR(IF(T100=\"\",\"\",'Rating Formula'!J98),\"         -\")","v":""},95,null,null,"","","","","",null,"","","","","","",null,null,"","","",null,null,"","","","",95]
[null,null,null,null,null,null,null,null,null,null,null,null,null,null,null,null,null,"","","","",{"$f":"IF(OR(U101=\"\",ISBLANK($E$11)=TRUE),\"\",TRUNC((YEAR(Tables!$E$18)-YEAR(U101))+(MONTH(Tables!$E$18)-MONTH(U101))/12+0.92,0)-1+IF(AND(MONTH(Tables!$E$18)=MONTH(U101),DAY(U101)=1),1,0))","v":""},{"$f":"IFERROR(IF(T101=\"\",\"\",'Rating Formula'!J99),\"         -\")","v":""},96,null,null,"","","","","",null,"","","","","","",null,null,"","","",null,null,"","","","",96]
[null,null,null,null,null,null,null,null,null,null,null,null,null,null,null,null,null,"","","","",{"$f":"IF(OR(U102=\"\",ISBLANK($E$11)=TRUE),\"\",TRUNC((YEAR(Tables!$E$18)-YEAR(U102))+(MONTH(Tables!$E$18)-MONTH(U102))/12+0.92,0)-1+IF(AND(MONTH(Tables!$E$18)=MONTH(U102),DAY(U102)=1),1,0))","v":""},{"$f":"IFERROR(IF(T102=\"\",\"\",'Rating Formula'!J100),\"         -\")","v":""},97,null,null,{"$f":"IF(ISNUMBER(R102)=TRUE,R102,\"\")","v":""},{"$f":"IF(ISNUMBER(R102)=TRUE,S102,\"\")","v":""},{"$f":"IF(ISNUMBER(R102)=TRUE,IF(T102=\"D\",IF(V102>20,\"Z\",\"Y\"),T102),\"\")","v":""},{"$f":"IF(ISNUMBER(R102)=TRUE,U102,\"\")","v":""},{"$f":"IF(ISNUMBER(R102)=TRUE,V102,\"\")","v":""},null,"","","","","","",null,null,"","","",null,null,{"$f":"R102&T102","v":""},{"$f":"V102","v":""},{"$f":"W102","v":""},{"$f":"IF(S102=0,\"\",S102)","v":""},97]
[null,null,null,null,null,null,null,null,null,null,null,null,null,null,null,null,null,"","","","",{"$f":"IF(OR(U103=\"\",ISBLANK($E$11)=TRUE),\"\",TRUNC((YEAR(Tables!$E$18)-YEAR(U103))+(MONTH(Tables!$E$18)-MONTH(U103))/12+0.92,0)-1+IF(AND(MONTH(Tables!$E$18)=MONTH(U103),DAY(U103)=1),1,0))","v":""},{"$f":"IFERROR(IF(T103=\"\",\"\",'Rating Formula'!J101),\"         -\")","v":""},98,null,null,"","","","","",null,"","","","","","",null,null,"","","",null,null,"","","","",98]
[null,null,null,null,null,null,null,null,null,null,null,null,null,null,null,null,null,"","","","",{"$f":"IF(OR(U104=\"\",ISBLANK($E$11)=TRUE),\"\",TRUNC((YEAR(Tables!$E$18)-YEAR(U104))+(MONTH(Tables!$E$18)-MONTH(U104))/12+0.92,0)-1+IF(AND(MONTH(Tables!$E$18)=MONTH(U104),DAY(U104)=1),1,0))","v":""},{"$f":"IFERROR(IF(T104=\"\",\"\",'Rating Formula'!J102),\"         -\")","v":""},99,null,null,"","","","","",null,"","","","","","",null,null,"","","",null,null,"","","","",99]
[null,null,null,null,null,null,null,null,null,null,null,null,null,null,null,null,null,"","","","",{"$f":"IF(OR(U105=\"\",ISBLANK($E$11)=TRUE),\"\",TRUNC((YEAR(Tables!$E$18)-YEAR(U105))+(MONTH(Tables!$E$18)-MONTH(U105))/12+0.92,0)-1+IF(AND(MONTH(Tables!$E$18)=MONTH(U105),DAY(U105)=1),1,0))","v":""},{"$f":"IFERROR(IF(T105=\"\",\"\",'Rating Formula'!J103),\"         -\")","v":""},100,null,null,"","","","","",null,"","","","","","",null,null,"","","",null,null,"","","","",100]
[null,null,null,null,null,null,null,null,null,null,null,null,null,null,null,null,null,"","","","",{"$f":"IF(OR(U106=\"\",ISBLANK($E$11)=TRUE),\"\",TRUNC((YEAR(Tables!$E$18)-YEAR(U106))+(MONTH(Tables!$E$18)-MONTH(U106))/12+0.92,0)-1+IF(AND(MONTH(Tables!$E$18)=MONTH(U106),DAY(U106)=1),1,0))","v":""},{"$f":"IFERROR(IF(T106=\"\",\"\",'Rating Formula'!J104),\"         -\")","v":""},101,null,null,"","","","","",null,"","","","","","",null,null,"","","",null,null,"","","","",101]
[null,null,null,null,null,null,null,null,null,null,null,null,null,null,null,null,null,"","","","",{"$f":"IF(OR(U107=\"\",ISBLANK($E$11)=TRUE),\"\",TRUNC((YEAR(Tables!$E$18)-YEAR(U107))+(MONTH(Tables!$E$18)-MONTH(U107))/12+0.92,0)-1+IF(AND(MONTH(Tables!$E$18)=MONTH(U107),DAY(U107)=1),1,0))","v":""},{"$f":"IFERROR(IF(T107=\"\",\"\",'Rating Formula'!J105),\"         -\")","v":""},102,null,null,"","","","","",null,"","","","","","",null,null,"","","",null,null,"","","","",102]
[null,null,null,null,null,null,null,null,null,null,null,null,null,null,null,null,null,"","","","",{"$f":"IF(OR(U108=\"\",ISBLANK($E$11)=TRUE),\"\",TRUNC((YEAR(Tables!$E$18)-YEAR(U108))+(MONTH(Tables!$E$18)-MONTH(U108))/12+0.92,0)-1+IF(AND(MONTH(Tables!$E$18)=MONTH(U108),DAY(U108)=1),1,0))","v":""},{"$f":"IFERROR(IF(T108=\"\",\"\",'Rating Formula'!J106),\"         -\")","v":""},103,null,null,"","","","","",null,"","","","","","",null,null,"","","",null,null,"","","","",103]
[null,null,null,null,null,null,null,null,null,null,null,null,null,null,null,null,null,"","","","",{"$f":"IF(OR(U109=\"\",ISBLANK($E$11)=TRUE),\"\",TRUNC((YEAR(Tables!$E$18)-YEAR(U109))+(MONTH(Tables!$E$18)-MONTH(U109))/12+0.92,0)-1+IF(AND(MONTH(Tables!$E$18)=MONTH(U109),DAY(U109)=1),1,0))","v":""},{"$f":"IFERROR(IF(T109=\"\",\"\",'Rating Formula'!J107),\"         -\")","v":""},104,null,null,"","","","","",null,"","","","","","",null,null,"","","",null,null,"","","","",104]
[null,null,null,null,null,null,null,null,null,null,null,null,null,null,null,null,null,"","","","",{"$f":"IF(OR(U110=\"\",ISBLANK($E$11)=TRUE),\"\",TRUNC((YEAR(Tables!$E$18)-YEAR(U110))+(MONTH(Tables!$E$18)-MONTH(U110))/12+0.92,0)-1+IF(AND(MONTH(Tables!$E$18)=MONTH(U110),DAY(U110)=1),1,0))","v":""},{"$f":"IFERROR(IF(T110=\"\",\"\",'Rating Formula'!J108),\"         -\")","v":""},105,null,null,"","","","","",null,"","","","","","",null,null,"","","",null,null,"","","","",105]
[null,null,null,null,null,null,null,null,null,null,null,null,null,null,null,null,null,"","","","",{"$f":"IF(OR(U111=\"\",ISBLANK($E$11)=TRUE),\"\",TRUNC((YEAR(Tables!$E$18)-YEAR(U111))+(MONTH(Tables!$E$18)-MONTH(U111))/12+0.92,0)-1+IF(AND(MONTH(Tables!$E$18)=MONTH(U111),DAY(U111)=1),1,0))","v":""},{"$f":"IFERROR(IF(T111=\"\",\"\",'Rating Formula'!J109),\"         -\")","v":""},106,null,null,"","","","","",null,"","","","","","",null,null,"","","",null,null,"","","","",106]
[null,null,null,null,null,null,null,null,null,null,null,null,null,null,null,null,null,"","","","",{"$f":"IF(OR(U112=\"\",ISBLANK($E$11)=TRUE),\"\",TRUNC((YEAR(Tables!$E$18)-YEAR(U112))+(MONTH(Tables!$E$18)-MONTH(U112))/12+0.92,0)-1+IF(AND(MONTH(Tables!$E$18)=MONTH(U112),DAY(U112)=1),1,0))","v":""},{"$f":"IFERROR(IF(T112=\"\",\"\",'Rating Formula'!J110),\"         -\")","v":""},107,null,null,"","","","","",null,"","","","","","",null,null,"","","",null,null,"","","","",107]
[null,null,null,null,null,null,null,null,null,null,null,null,null,null,null,null,null,"","","","",{"$f":"IF(OR(U113=\"\",ISBLANK($E$11)=TRUE),\"\",TRUNC((YEAR(Tables!$E$18)-YEAR(U113))+(MONTH(Tables!$E$18)-MONTH(U113))/12+0.92,0)-1+IF(AND(MONTH(Tables!$E$18)=MONTH(U113),DAY(U113)=1),1,0))","v":""},{"$f":"IFERROR(IF(T113=\"\",\"\",'Rating Formula'!J111),\"         -\")","v":""},108,null,null,"","","","","",null,"","","","","","",null,null,"","","",null,null,"","","","",108]
[null,null,null,null,null,null,null,null,null,null,null,null,null,null,null,null,null,"","","","",{"$f":"IF(OR(U114=\"\",ISBLANK($E$11)=TRUE),\"\",TRUNC((YEAR(Tables!$E$18)-YEAR(U114))+(MONTH(Tables!$E$18)-MONTH(U114))/12+0.92,0)-1+IF(AND(MONTH(Tables!$E$18)=MONTH(U114),DAY(U114)=1),1,0))","v":""},{"$f":"IFERROR(IF(T114=\"\",\"\",'Rating Formula'!J112),\"         -\")","v":""},109,null,null,"","","","","",null,"","","","","","",null,null,"","","",null,null,"","","","",109]
[null,null,null,null,null,null,null,null,null,null,null,null,null,null,null,null,null,"","","","",{"$f":"IF(OR(U115=\"\",ISBLANK($E$11)=TRUE),\"\",TRUNC((YEAR(Tables!$E$18)-YEAR(U115))+(MONTH(Tables!$E$18)-MONTH(U115))/12+0.92,0)-1+IF(AND(MONTH(Tables!$E$18)=MONTH(U115),DAY(U115)=1),1,0))","v":""},{"$f":"IFERROR(IF(T115=\"\",\"\",'Rating Formula'!J113),\"         -\")","v":""},110,null,null,"","","","","",null,"","","","","","",null,null,"","","",null,null,"","","","",110]
[null,null,null,null,null,null,null,null,null,null,null,null,null,null,null,null,null,"","","","",{"$f":"IF(OR(U116=\"\",ISBLANK($E$11)=TRUE),\"\",TRUNC((YEAR(Tables!$E$18)-YEAR(U116))+(MONTH(Tables!$E$18)-MONTH(U116))/12+0.92,0)-1+IF(AND(MONTH(Tables!$E$18)=MONTH(U116),DAY(U116)=1),1,0))","v":""},{"$f":"IFERROR(IF(T116=\"\",\"\",'Rating Formula'!J114),\"         -\")","v":""},111,null,null,"","","","","",null,"","","","","","",null,null,"","","",null,null,"","","","",111]
[null,null,null,null,null,null,null,null,null,null,null,null,null,null,null,null,null,"","","","",{"$f":"IF(OR(U117=\"\",ISBLANK($E$11)=TRUE),\"\",TRUNC((YEAR(Tables!$E$18)-YEAR(U117))+(MONTH(Tables!$E$18)-MONTH(U117))/12+0.92,0)-1+IF(AND(MONTH(Tables!$E$18)=MONTH(U117),DAY(U117)=1),1,0))","v":""},{"$f":"IFERROR(IF(T117=\"\",\"\",'Rating Formula'!J115),\"         -\")","v":""},112,null,null,"","","","","",null,"","","","","","",null,null,"","","",null,null,"","","","",112]
[null,null,null,null,null,null,null,null,null,null,null,null,null,null,null,null,null,"","","","",{"$f":"IF(OR(U118=\"\",ISBLANK($E$11)=TRUE),\"\",TRUNC((YEAR(Tables!$E$18)-YEAR(U118))+(MONTH(Tables!$E$18)-MONTH(U118))/12+0.92,0)-1+IF(AND(MONTH(Tables!$E$18)=MONTH(U118),DAY(U118)=1),1,0))","v":""},{"$f":"IFERROR(IF(T118=\"\",\"\",'Rating Formula'!J116),\"         -\")","v":""},113,null,null,"","","","","",null,"","","","","","",null,null,"","","",null,null,"","","","",113]
[null,null,null,null,null,null,null,null,null,null,null,null,null,null,null,null,null,"","","","",{"$f":"IF(OR(U119=\"\",ISBLANK($E$11)=TRUE),\"\",TRUNC((YEAR(Tables!$E$18)-YEAR(U119))+(MONTH(Tables!$E$18)-MONTH(U119))/12+0.92,0)-1+IF(AND(MONTH(Tables!$E$18)=MONTH(U119),DAY(U119)=1),1,0))","v":""},{"$f":"IFERROR(IF(T119=\"\",\"\",'Rating Formula'!J117),\"         -\")","v":""},114,null,null,"","","","","",null,"","","","","","",null,null,"","","",null,null,"","","","",114]
[null,null,null,null,null,null,null,null,null,null,null,null,null,null,null,null,null,"","","","",{"$f":"IF(OR(U120=\"\",ISBLANK($E$11)=TRUE),\"\",TRUNC((YEAR(Tables!$E$18)-YEAR(U120))+(MONTH(Tables!$E$18)-MONTH(U120))/12+0.92,0)-1+IF(AND(MONTH(Tables!$E$18)=MONTH(U120),DAY(U120)=1),1,0))","v":""},{"$f":"IFERROR(IF(T120=\"\",\"\",'Rating Formula'!J118),\"         -\")","v":""},115,null,null,"","","","","",null,"","","","","","",null,null,"","","",null,null,"","","","",115]
[null,null,null,null,null,null,null,null,null,null,null,null,null,null,null,null,null,"","","","",{"$f":"IF(OR(U121=\"\",ISBLANK($E$11)=TRUE),\"\",TRUNC((YEAR(Tables!$E$18)-YEAR(U121))+(MONTH(Tables!$E$18)-MONTH(U121))/12+0.92,0)-1+IF(AND(MONTH(Tables!$E$18)=MONTH(U121),DAY(U121)=1),1,0))","v":""},{"$f":"IFERROR(IF(T121=\"\",\"\",'Rating Formula'!J119),\"         -\")","v":""},116,null,null,"","","","","",null,"","","","","","",null,null,"","","",null,null,"","","","",116]
[null,null,null,null,null,null,null,null,null,null,null,null,null,null,null,null,null,"","","","",{"$f":"IF(OR(U122=\"\",ISBLANK($E$11)=TRUE),\"\",TRUNC((YEAR(Tables!$E$18)-YEAR(U122))+(MONTH(Tables!$E$18)-MONTH(U122))/12+0.92,0)-1+IF(AND(MONTH(Tables!$E$18)=MONTH(U122),DAY(U122)=1),1,0))","v":""},{"$f":"IFERROR(IF(T122=\"\",\"\",'Rating Formula'!J120),\"         -\")","v":""},117,null,null,"","","","","",null,"","","","","","",null,null,"","","",null,null,"","","","",117]
[null,null,null,null,null,null,null,null,null,null,null,null,null,null,null,null,null,"","","","",{"$f":"IF(OR(U123=\"\",ISBLANK($E$11)=TRUE),\"\",TRUNC((YEAR(Tables!$E$18)-YEAR(U123))+(MONTH(Tables!$E$18)-MONTH(U123))/12+0.92,0)-1+IF(AND(MONTH(Tables!$E$18)=MONTH(U123),DAY(U123)=1),1,0))","v":""},{"$f":"IFERROR(IF(T123=\"\",\"\",'Rating Formula'!J121),\"         -\")","v":""},118,null,null,"","","","","",null,"","","","","","",null,null,"","","",null,null,"","","","",118]
[null,null,null,null,null,null,null,null,null,null,null,null,null,null,null,null,null,"","","","",{"$f":"IF(OR(U124=\"\",ISBLANK($E$11)=TRUE),\"\",TRUNC((YEAR(Tables!$E$18)-YEAR(U124))+(MONTH(Tables!$E$18)-MONTH(U124))/12+0.92,0)-1+IF(AND(MONTH(Tables!$E$18)=MONTH(U124),DAY(U124)=1),1,0))","v":""},{"$f":"IFERROR(IF(T124=\"\",\"\",'Rating Formula'!J122),\"         -\")","v":""},119,null,null,"","","","","",null,"","","","","","",null,null,"","","",null,null,"","","","",119]
[null,null,null,null,null,null,null,null,null,null,null,null,null,null,null,null,null,"","","","",{"$f":"IF(OR(U125=\"\",ISBLANK($E$11)=TRUE),\"\",TRUNC((YEAR(Tables!$E$18)-YEAR(U125))+(MONTH(Tables!$E$18)-MONTH(U125))/12+0.92,0)-1+IF(AND(MONTH(Tables!$E$18)=MONTH(U125),DAY(U125)=1),1,0))","v":""},{"$f":"IFERROR(IF(T125=\"\",\"\",'Rating Formula'!J123),\"         -\")","v":""},120,null,null,"","","","","",null,"","","","","","",null,null,"","","",null,null,"","","","",120]
[null,null,null,null,null,null,null,null,null,null,null,null,null,null,null,null,null,"","","","",{"$f":"IF(OR(U126=\"\",ISBLANK($E$11)=TRUE),\"\",TRUNC((YEAR(Tables!$E$18)-YEAR(U126))+(MONTH(Tables!$E$18)-MONTH(U126))/12+0.92,0)-1+IF(AND(MONTH(Tables!$E$18)=MONTH(U126),DAY(U126)=1),1,0))","v":""},{"$f":"IFERROR(IF(T126=\"\",\"\",'Rating Formula'!J124),\"         -\")","v":""},121,null,null,"","","","","",null,"","","","","","",null,null,"","","",null,null,"","","","",121]
[null,null,null,null,null,null,null,null,null,null,null,null,null,null,null,null,null,"","","","",{"$f":"IF(OR(U127=\"\",ISBLANK($E$11)=TRUE),\"\",TRUNC((YEAR(Tables!$E$18)-YEAR(U127))+(MONTH(Tables!$E$18)-MONTH(U127))/12+0.92,0)-1+IF(AND(MONTH(Tables!$E$18)=MONTH(U127),DAY(U127)=1),1,0))","v":""},{"$f":"IFERROR(IF(T127=\"\",\"\",'Rating Formula'!J125),\"         -\")","v":""},122,null,null,"","","","","",null,"","","","","","",null,null,"","","",null,null,"","","","",122]
[null,null,null,null,null,null,null,null,null,null,null,null,null,null,null,null,null,"","","","",{"$f":"IF(OR(U128=\"\",ISBLANK($E$11)=TRUE),\"\",TRUNC((YEAR(Tables!$E$18)-YEAR(U128))+(MONTH(Tables!$E$18)-MONTH(U128))/12+0.92,0)-1+IF(AND(MONTH(Tables!$E$18)=MONTH(U128),DAY(U128)=1),1,0))","v":""},{"$f":"IFERROR(IF(T128=\"\",\"\",'Rating Formula'!J126),\"         -\")","v":""},123,null,null,"","","","","",null,"","","","","","",null,null,"","","",null,null,"","","","",123]
[null,null,null,null,null,null,null,null,null,null,null,null,null,null,null,null,null,"","","","",{"$f":"IF(OR(U129=\"\",ISBLANK($E$11)=TRUE),\"\",TRUNC((YEAR(Tables!$E$18)-YEAR(U129))+(MONTH(Tables!$E$18)-MONTH(U129))/12+0.92,0)-1+IF(AND(MONTH(Tables!$E$18)=MONTH(U129),DAY(U129)=1),1,0))","v":""},{"$f":"IFERROR(IF(T129=\"\",\"\",'Rating Formula'!J127),\"         -\")","v":""},124,null,null,"","","","","",null,"","","","","","",null,null,"","","",null,null,"","","","",124]
[null,null,null,null,null,null,null,null,null,null,null,null,null,null,null,null,null,"","","","",{"$f":"IF(OR(U130=\"\",ISBLANK($E$11)=TRUE),\"\",TRUNC((YEAR(Tables!$E$18)-YEAR(U130))+(MONTH(Tables!$E$18)-MONTH(U130))/12+0.92,0)-1+IF(AND(MONTH(Tables!$E$18)=MONTH(U130),DAY(U130)=1),1,0))","v":""},{"$f":"IFERROR(IF(T130=\"\",\"\",'Rating Formula'!J128),\"         -\")","v":""},125,null,null,"","","","","",null,"","","","","","",null,null,"","","",null,null,"","","","",125]
[null,null,null,null,null,null,null,null,null,null,null,null,null,null,null,null,null,"","","","",{"$f":"IF(OR(U131=\"\",ISBLANK($E$11)=TRUE),\"\",TRUNC((YEAR(Tables!$E$18)-YEAR(U131))+(MONTH(Tables!$E$18)-MONTH(U131))/12+0.92,0)-1+IF(AND(MONTH(Tables!$E$18)=MONTH(U131),DAY(U131)=1),1,0))","v":""},{"$f":"IFERROR(IF(T131=\"\",\"\",'Rating Formula'!J129),\"         -\")","v":""},126,null,null,"","","","","",null,"","","","","","",null,null,"","","",null,null,"","","","",126]
[null,null,null,null,null,null,null,null,null,null,null,null,null,null,null,null,null,"","","","",{"$f":"IF(OR(U132=\"\",ISBLANK($E$11)=TRUE),\"\",TRUNC((YEAR(Tables!$E$18)-YEAR(U132))+(MONTH(Tables!$E$18)-MONTH(U132))/12+0.92,0)-1+IF(AND(MONTH(Tables!$E$18)=MONTH(U132),DAY(U132)=1),1,0))","v":""},{"$f":"IFERROR(IF(T132=\"\",\"\",'Rating Formula'!J130),\"         -\")","v":""},127,null,null,"","","","","",null,"","","","","","",null,null,"","","",null,null,"","","","",{"$f":"1+AX131","v":127}]
[null,null,null,null,null,null,null,null,null,null,null,null,null,null,null,null,null,"","","","",{"$f":"IF(OR(U133=\"\",ISBLANK($E$11)=TRUE),\"\",TRUNC((YEAR(Tables!$E$18)-YEAR(U133))+(MONTH(Tables!$E$18)-MONTH(U133))/12+0.92,0)-1+IF(AND(MONTH(Tables!$E$18)=MONTH(U133),DAY(U133)=1),1,0))","v":""},{"$f":"IFERROR(IF(T133=\"\",\"\",'Rating Formula'!J131),\"         -\")","v":""},128,null,null,"","","","","",null,"","","","","","",null,null,"","","",null,null,"","","","",{"$f":"1+AX132","v":128}]
[null,null,null,null,null,null,null,null,null,null,null,null,null,null,null,null,null,"","","","",{"$f":"IF(OR(U134=\"\",ISBLANK($E$11)=TRUE),\"\",TRUNC((YEAR(Tables!$E$18)-YEAR(U134))+(MONTH(Tables!$E$18)-MONTH(U134))/12+0.92,0)-1+IF(AND(MONTH(Tables!$E$18)=MONTH(U134),DAY(U134)=1),1,0))","v":""},{"$f":"IFERROR(IF(T134=\"\",\"\",'Rating Formula'!J132),\"         -\")","v":""},129,null,null,{"$f":"IF(ISNUMBER(R134)=TRUE,R134,\"\")","v":""},{"$f":"IF(ISNUMBER(R134)=TRUE,S134,\"\")","v":""},{"$f":"IF(ISNUMBER(R134)=TRUE,IF(T134=\"D\",IF(V134>20,\"Z\",\"Y\"),T134),\"\")","v":""},{"$f":"IF(ISNUMBER(R134)=TRUE,U134,\"\")","v":""},{"$f":"IF(ISNUMBER(R134)=TRUE,V134,\"\")","v":""},null,{"$f":"IF(AH134=\"\",\"\",IF(AJ134=\"Y\",AG133+1,0))","v":""},"","","","","",null,null,"","","",null,null,{"$f":"R134&T134","v":""},{"$f":"V134","v":""},{"$f":"W134","v":""},{"$f":"IF(S134=0,\"\",S134)","v":""},129]
[null,null,null,null,null,null,null,null,null,null,null,null,null,null,null,null,null,"","","","",{"$f":"IF(OR(U135=\"\",ISBLANK($E$11)=TRUE),\"\",TRUNC((YEAR(Tables!$E$18)-YEAR(U135))+(MONTH(Tables!$E$18)-MONTH(U135))/12+0.92,0)-1+IF(AND(MONTH(Tables!$E$18)=MONTH(U135),DAY(U135)=1),1,0))","v":""},{"$f":"IFERROR(IF(T135=\"\",\"\",'Rating Formula'!J133),\"         -\")","v":""},130,null,null,"","","","","",null,"","","","","","",null,null,{"$f":"IF(AI135=\"\",\"\",AI135)","v":""},"",{"$f":"IF(AK135=\"\",\"\",AK135)","v":""},null,null,"","","","",130]
[null,null,null,null,null,null,null,null,null,null,null,null,null,null,null,null,null,"","","","",{"$f":"IF(OR(U136=\"\",ISBLANK($E$11)=TRUE),\"\",TRUNC((YEAR(Tables!$E$18)-YEAR(U136))+(MONTH(Tables!$E$18)-MONTH(U136))/12+0.92,0)-1+IF(AND(MONTH(Tables!$E$18)=MONTH(U136),DAY(U136)=1),1,0))","v":""},{"$f":"IFERROR(IF(T136=\"\",\"\",'Rating Formula'!J134),\"         -\")","v":""},131,null,null,"","","","","",null,"","","","","","",null,null,"",{"$f":"IF(OR(AJ136=\"Y\",AJ136=\"Z\"),\"D\",UPPER(AJ136))","v":""},"",null,null,"","","","",131]
[null,null,null,null,null,null,null,null,null,null,null,null,null,null,null,null,null,"","","","",{"$f":"IF(OR(U137=\"\",ISBLANK($E$11)=TRUE),\"\",TRUNC((YEAR(Tables!$E$18)-YEAR(U137))+(MONTH(Tables!$E$18)-MONTH(U137))/12+0.92,0)-1+IF(AND(MONTH(Tables!$E$18)=MONTH(U137),DAY(U137)=1),1,0))","v":""},{"$f":"IFERROR(IF(T137=\"\",\"\",'Rating Formula'!J135),\"         -\")","v":""},132,null,null,"","","","","",null,"","","","","","",null,null,"","","",null,null,"","","","",132]
[null,null,null,null,null,null,null,null,null,null,null,null,null,null,null,null,null,"","","","",{"$f":"IF(OR(U138=\"\",ISBLANK($E$11)=TRUE),\"\",TRUNC((YEAR(Tables!$E$18)-YEAR(U138))+(MONTH(Tables!$E$18)-MONTH(U138))/12+0.92,0)-1+IF(AND(MONTH(Tables!$E$18)=MONTH(U138),DAY(U138)=1),1,0))","v":""},{"$f":"IFERROR(IF(T138=\"\",\"\",'Rating Formula'!J136),\"         -\")","v":""},133,null,null,"","","","","",null,"","","","","","",null,null,"","","",null,null,"","","","",133]
[null,null,null,null,null,null,null,null,null,null,null,null,null,null,null,null,null,"","","","",{"$f":"IF(OR(U139=\"\",ISBLANK($E$11)=TRUE),\"\",TRUNC((YEAR(Tables!$E$18)-YEAR(U139))+(MONTH(Tables!$E$18)-MONTH(U139))/12+0.92,0)-1+IF(AND(MONTH(Tables!$E$18)=MONTH(U139),DAY(U139)=1),1,0))","v":""},{"$f":"IFERROR(IF(T139=\"\",\"\",'Rating Formula'!J137),\"         -\")","v":""},134,null,null,"","","","","",null,"","","","","","",null,null,"","","",null,null,"","","","",134]
[null,null,null,null,null,null,null,null,null,null,null,null,null,null,null,null,null,"","","","",{"$f":"IF(OR(U140=\"\",ISBLANK($E$11)=TRUE),\"\",TRUNC((YEAR(Tables!$E$18)-YEAR(U140))+(MONTH(Tables!$E$18)-MONTH(U140))/12+0.92,0)-1+IF(AND(MONTH(Tables!$E$18)=MONTH(U140),DAY(U140)=1),1,0))","v":""},{"$f":"IFERROR(IF(T140=\"\",\"\",'Rating Formula'!J138),\"         -\")","v":""},135,null,null,"","","","","",null,"","","","","","",null,null,"","","",null,null,"","","","",135]
[null,null,null,null,null,null,null,null,null,null,null,null,null,null,null,null,null,"","","","",{"$f":"IF(OR(U141=\"\",ISBLANK($E$11)=TRUE),\"\",TRUNC((YEAR(Tables!$E$18)-YEAR(U141))+(MONTH(Tables!$E$18)-MONTH(U141))/12+0.92,0)-1+IF(AND(MONTH(Tables!$E$18)=MONTH(U141),DAY(U141)=1),1,0))","v":""},{"$f":"IFERROR(IF(T141=\"\",\"\",'Rating Formula'!J139),\"         -\")","v":""},136,null,null,"","","","","",null,"","","","","","",null,null,"","","",null,null,"","","","",136]
[null,null,null,null,null,null,null,null,null,null,null,null,null,null,null,null,null,"","","","",{"$f":"IF(OR(U142=\"\",ISBLANK($E$11)=TRUE),\"\",TRUNC((YEAR(Tables!$E$18)-YEAR(U142))+(MONTH(Tables!$E$18)-MONTH(U142))/12+0.92,0)-1+IF(AND(MONTH(Tables!$E$18)=MONTH(U142),DAY(U142)=1),1,0))","v":""},{"$f":"IFERROR(IF(T142=\"\",\"\",'Rating Formula'!J140),\"         -\")","v":""},137,null,null,"","","","","",null,"","","","","","",null,null,"","","",null,null,"","","","",137]
[null,null,null,null,null,null,null,null,null,null,null,null,null,null,null,null,null,"","","","",{"$f":"IF(OR(U143=\"\",ISBLANK($E$11)=TRUE),\"\",TRUNC((YEAR(Tables!$E$18)-YEAR(U143))+(MONTH(Tables!$E$18)-MONTH(U143))/12+0.92,0)-1+IF(AND(MONTH(Tables!$E$18)=MONTH(U143),DAY(U143)=1),1,0))","v":""},{"$f":"IFERROR(IF(T143=\"\",\"\",'Rating Formula'!J141),\"         -\")","v":""},138,null,null,"","","","","",null,"","","","","","",null,null,"","","",null,null,"","","","",138]
[null,null,null,null,null,null,null,null,null,null,null,null,null,null,null,null,null,"","","","",{"$f":"IF(OR(U144=\"\",ISBLANK($E$11)=TRUE),\"\",TRUNC((YEAR(Tables!$E$18)-YEAR(U144))+(MONTH(Tables!$E$18)-MONTH(U144))/12+0.92,0)-1+IF(AND(MONTH(Tables!$E$18)=MONTH(U144),DAY(U144)=1),1,0))","v":""},{"$f":"IFERROR(IF(T144=\"\",\"\",'Rating Formula'!J142),\"         -\")","v":""},139,null,null,"","","","","",null,"","","","","","",null,null,"","","",null,null,"","","","",139]
[null,null,null,null,null,null,null,null,null,null,null,null,null,null,null,null,null,"","","","",{"$f":"IF(OR(U145=\"\",ISBLANK($E$11)=TRUE),\"\",TRUNC((YEAR(Tables!$E$18)-YEAR(U145))+(MONTH(Tables!$E$18)-MONTH(U145))/12+0.92,0)-1+IF(AND(MONTH(Tables!$E$18)=MONTH(U145),DAY(U145)=1),1,0))","v":""},{"$f":"IFERROR(IF(T145=\"\",\"\",'Rating Formula'!J143),\"         -\")","v":""},140,null,null,"","","","","",null,"","","","","","",null,null,"","","",null,null,"","","","",140]
[null,null,null,null,null,null,null,null,null,null,null,null,null,null,null,null,null,"","","","",{"$f":"IF(OR(U146=\"\",ISBLANK($E$11)=TRUE),\"\",TRUNC((YEAR(Tables!$E$18)-YEAR(U146))+(MONTH(Tables!$E$18)-MONTH(U146))/12+0.92,0)-1+IF(AND(MONTH(Tables!$E$18)=MONTH(U146),DAY(U146)=1),1,0))","v":""},{"$f":"IFERROR(IF(T146=\"\",\"\",'Rating Formula'!J144),\"         -\")","v":""},141,null,null,"","","","","",null,"","","","","","",null,null,"","","",null,null,"","","","",141]
[null,null,null,null,null,null,null,null,null,null,null,null,null,null,null,null,null,"","","","",{"$f":"IF(OR(U147=\"\",ISBLANK($E$11)=TRUE),\"\",TRUNC((YEAR(Tables!$E$18)-YEAR(U147))+(MONTH(Tables!$E$18)-MONTH(U147))/12+0.92,0)-1+IF(AND(MONTH(Tables!$E$18)=MONTH(U147),DAY(U147)=1),1,0))","v":""},{"$f":"IFERROR(IF(T147=\"\",\"\",'Rating Formula'!J145),\"         -\")","v":""},142,null,null,"","","","","",null,"","","","","","",null,null,"","","",null,null,"","","","",142]
[null,null,null,null,null,null,null,null,null,null,null,null,null,null,null,null,null,{"$f":"IF(T148=\"\",\"\",IF(T148=\"E\",R147+1,R147))","v":""},"","","",{"$f":"IF(OR(U148=\"\",ISBLANK($E$11)=TRUE),\"\",TRUNC((YEAR(Tables!$E$18)-YEAR(U148))+(MONTH(Tables!$E$18)-MONTH(U148))/12+0.92,0)-1+IF(AND(MONTH(Tables!$E$18)=MONTH(U148),DAY(U148)=1),1,0))","v":""},{"$f":"IFERROR(IF(T148=\"\",\"\",'Rating Formula'!J146),\"         -\")","v":""},143,null,null,"","","","","",null,"","","","","","",null,null,"","","",null,null,"","","","",143]
[null,null,null,null,null,null,null,null,null,null,null,null,null,null,null,null,null,"","","","",{"$f":"IF(OR(U149=\"\",ISBLANK($E$11)=TRUE),\"\",TRUNC((YEAR(Tables!$E$18)-YEAR(U149))+(MONTH(Tables!$E$18)-MONTH(U149))/12+0.92,0)-1+IF(AND(MONTH(Tables!$E$18)=MONTH(U149),DAY(U149)=1),1,0))","v":""},{"$f":"IFERROR(IF(T149=\"\",\"\",'Rating Formula'!J147),\"         -\")","v":""},144,null,null,"","","","","",null,"","","","","","",null,null,"","","",null,null,"","","","",144]
[null,null,null,null,null,null,null,null,null,null,null,null,null,null,null,null,null,"","","","",{"$f":"IF(OR(U150=\"\",ISBLANK($E$11)=TRUE),\"\",TRUNC((YEAR(Tables!$E$18)-YEAR(U150))+(MONTH(Tables!$E$18)-MONTH(U150))/12+0.92,0)-1+IF(AND(MONTH(Tables!$E$18)=MONTH(U150),DAY(U150)=1),1,0))","v":""},{"$f":"IFERROR(IF(T150=\"\",\"\",'Rating Formula'!J148),\"         -\")","v":""},145,null,null,"","","","","",null,"","","","","","",null,null,"","","",null,null,"","","","",145]
[null,null,null,null,null,null,null,null,null,null,null,null,null,null,null,null,null,"","","","",{"$f":"IF(OR(U151=\"\",ISBLANK($E$11)=TRUE),\"\",TRUNC((YEAR(Tables!$E$18)-YEAR(U151))+(MONTH(Tables!$E$18)-MONTH(U151))/12+0.92,0)-1+IF(AND(MONTH(Tables!$E$18)=MONTH(U151),DAY(U151)=1),1,0))","v":""},{"$f":"IFERROR(IF(T151=\"\",\"\",'Rating Formula'!J149),\"         -\")","v":""},146,null,null,"","","","","",null,"","","","","","",null,null,"","","",null,null,"","","","",146]
[null,null,null,null,null,null,null,null,null,null,null,null,null,null,null,null,null,"","","","",{"$f":"IF(OR(U152=\"\",ISBLANK($E$11)=TRUE),\"\",TRUNC((YEAR(Tables!$E$18)-YEAR(U152))+(MONTH(Tables!$E$18)-MONTH(U152))/12+0.92,0)-1+IF(AND(MONTH(Tables!$E$18)=MONTH(U152),DAY(U152)=1),1,0))","v":""},{"$f":"IFERROR(IF(T152=\"\",\"\",'Rating Formula'!J150),\"         -\")","v":""},147,null,null,"","","","","",null,"","","","","","",null,null,"","","",null,null,"","","","",147]
[null,null,null,null,null,null,null,null,null,null,null,null,null,null,null,null,null,"","","","",{"$f":"IF(OR(U153=\"\",ISBLANK($E$11)=TRUE),\"\",TRUNC((YEAR(Tables!$E$18)-YEAR(U153))+(MONTH(Tables!$E$18)-MONTH(U153))/12+0.92,0)-1+IF(AND(MONTH(Tables!$E$18)=MONTH(U153),DAY(U153)=1),1,0))","v":""},{"$f":"IFERROR(IF(T153=\"\",\"\",'Rating Formula'!J151),\"         -\")","v":""},148,null,null,"","","","","",null,"","","","","","",null,null,"","","",null,null,"","","","",148]
[null,null,null,null,null,null,null,null,null,null,null,null,null,null,null,null,null,"","","","",{"$f":"IF(OR(U154=\"\",ISBLANK($E$11)=TRUE),\"\",TRUNC((YEAR(Tables!$E$18)-YEAR(U154))+(MONTH(Tables!$E$18)-MONTH(U154))/12+0.92,0)-1+IF(AND(MONTH(Tables!$E$18)=MONTH(U154),DAY(U154)=1),1,0))","v":""},{"$f":"IFERROR(IF(T154=\"\",\"\",'Rating Formula'!J152),\"         -\")","v":""},149,null,null,"","","","","",null,"","","","","","",null,null,"","","",null,null,"","","","",149]
[null,null,null,null,null,null,null,null,null,null,null,null,null,null,null,null,null,"","","","",{"$f":"IF(OR(U155=\"\",ISBLANK($E$11)=TRUE),\"\",TRUNC((YEAR(Tables!$E$18)-YEAR(U155))+(MONTH(Tables!$E$18)-MONTH(U155))/12+0.92,0)-1+IF(AND(MONTH(Tables!$E$18)=MONTH(U155),DAY(U155)=1),1,0))","v":""},{"$f":"IFERROR(IF(T155=\"\",\"\",'Rating Formula'!J153),\"         -\")","v":""},150,null,null,"","","","","",null,"","","","","","",null,null,"","","",null,null,"","","","",150]
[null,null,null,null,null,null,null,null,null,null,null,null,null,null,null,null,null,"","","","",{"$f":"IF(OR(U156=\"\",ISBLANK($E$11)=TRUE),\"\",TRUNC((YEAR(Tables!$E$18)-YEAR(U156))+(MONTH(Tables!$E$18)-MONTH(U156))/12+0.92,0)-1+IF(AND(MONTH(Tables!$E$18)=MONTH(U156),DAY(U156)=1),1,0))","v":""},{"$f":"IFERROR(IF(T156=\"\",\"\",'Rating Formula'!J154),\"         -\")","v":""},151,null,null,"","","","","",null,"","","","","","",null,null,"","","",null,null,"","","","",151]
[null,null,null,null,null,null,null,null,null,null,null,null,null,null,null,null,null,"","","","",{"$f":"IF(OR(U157=\"\",ISBLANK($E$11)=TRUE),\"\",TRUNC((YEAR(Tables!$E$18)-YEAR(U157))+(MONTH(Tables!$E$18)-MONTH(U157))/12+0.92,0)-1+IF(AND(MONTH(Tables!$E$18)=MONTH(U157),DAY(U157)=1),1,0))","v":""},{"$f":"IFERROR(IF(T157=\"\",\"\",'Rating Formula'!J155),\"         -\")","v":""},152,null,null,"","","","","",null,"","","","","","",null,null,"","","",null,null,"","","","",152]
[null,null,null,null,null,null,null,null,null,null,null,null,null,null,null,null,null,"","","","",{"$f":"IF(OR(U158=\"\",ISBLANK($E$11)=TRUE),\"\",TRUNC((YEAR(Tables!$E$18)-YEAR(U158))+(MONTH(Tables!$E$18)-MONTH(U158))/12+0.92,0)-1+IF(AND(MONTH(Tables!$E$18)=MONTH(U158),DAY(U158)=1),1,0))","v":""},{"$f":"IFERROR(IF(T158=\"\",\"\",'Rating Formula'!J156),\"         -\")","v":""},153,null,null,"","","","","",null,"","","","","","",null,null,"","","",null,null,"","","","",153]
[null,null,null,null,null,null,null,null,null,null,null,null,null,null,null,null,null,"","","","",{"$f":"IF(OR(U159=\"\",ISBLANK($E$11)=TRUE),\"\",TRUNC((YEAR(Tables!$E$18)-YEAR(U159))+(MONTH(Tables!$E$18)-MONTH(U159))/12+0.92,0)-1+IF(AND(MONTH(Tables!$E$18)=MONTH(U159),DAY(U159)=1),1,0))","v":""},{"$f":"IFERROR(IF(T159=\"\",\"\",'Rating Formula'!J157),\"         -\")","v":""},154,null,null,"","","","","",null,"","","","","","",null,null,"","","",null,null,"","","","",154]
[null,null,null,null,null,null,null,null,null,null,null,null,null,null,null,null,null,"","","","",{"$f":"IF(OR(U160=\"\",ISBLANK($E$11)=TRUE),\"\",TRUNC((YEAR(Tables!$E$18)-YEAR(U160))+(MONTH(Tables!$E$18)-MONTH(U160))/12+0.92,0)-1+IF(AND(MONTH(Tables!$E$18)=MONTH(U160),DAY(U160)=1),1,0))","v":""},{"$f":"IFERROR(IF(T160=\"\",\"\",'Rating Formula'!J158),\"         -\")","v":""},155,null,null,"","","","","",null,"","","","","","",null,null,"","","",null,null,"","","","",155]
[null,null,null,null,null,null,null,null,null,null,null,null,null,null,null,null,null,"","","","",{"$f":"IF(OR(U161=\"\",ISBLANK($E$11)=TRUE),\"\",TRUNC((YEAR(Tables!$E$18)-YEAR(U161))+(MONTH(Tables!$E$18)-MONTH(U161))/12+0.92,0)-1+IF(AND(MONTH(Tables!$E$18)=MONTH(U161),DAY(U161)=1),1,0))","v":""},{"$f":"IFERROR(IF(T161=\"\",\"\",'Rating Formula'!J159),\"         -\")","v":""},156,null,null,"","","","","",null,"","","","","","",null,null,"","","",null,null,"","","","",156]
[null,null,null,null,null,null,null,null,null,null,null,null,null,null,null,null,null,"","","","",{"$f":"IF(OR(U162=\"\",ISBLANK($E$11)=TRUE),\"\",TRUNC((YEAR(Tables!$E$18)-YEAR(U162))+(MONTH(Tables!$E$18)-MONTH(U162))/12+0.92,0)-1+IF(AND(MONTH(Tables!$E$18)=MONTH(U162),DAY(U162)=1),1,0))","v":""},{"$f":"IFERROR(IF(T162=\"\",\"\",'Rating Formula'!J160),\"         -\")","v":""},157,null,null,"","","","","",null,"","","","","","",null,null,"","","",null,null,"","","","",157]
[null,null,null,null,null,null,null,null,null,null,null,null,null,null,null,null,null,"","","","",{"$f":"IF(OR(U163=\"\",ISBLANK($E$11)=TRUE),\"\",TRUNC((YEAR(Tables!$E$18)-YEAR(U163))+(MONTH(Tables!$E$18)-MONTH(U163))/12+0.92,0)-1+IF(AND(MONTH(Tables!$E$18)=MONTH(U163),DAY(U163)=1),1,0))","v":""},{"$f":"IFERROR(IF(T163=\"\",\"\",'Rating Formula'!J161),\"         -\")","v":""},158,null,null,"","","","","",null,"","","","","","",null,null,"","","",null,null,"","","","",158]
[null,null,null,null,null,null,null,null,null,null,null,null,null,null,null,null,null,"","","","",{"$f":"IF(OR(U164=\"\",ISBLANK($E$11)=TRUE),\"\",TRUNC((YEAR(Tables!$E$18)-YEAR(U164))+(MONTH(Tables!$E$18)-MONTH(U164))/12+0.92,0)-1+IF(AND(MONTH(Tables!$E$18)=MONTH(U164),DAY(U164)=1),1,0))","v":""},{"$f":"IFERROR(IF(T164=\"\",\"\",'Rating Formula'!J162),\"         -\")","v":""},159,null,null,"","","","","",null,"","","","","","",null,null,"","","",null,null,"","","","",159]
[null,null,null,null,null,null,null,null,null,null,null,null,null,null,null,null,null,"","","","",{"$f":"IF(OR(U165=\"\",ISBLANK($E$11)=TRUE),\"\",TRUNC((YEAR(Tables!$E$18)-YEAR(U165))+(MONTH(Tables!$E$18)-MONTH(U165))/12+0.92,0)-1+IF(AND(MONTH(Tables!$E$18)=MONTH(U165),DAY(U165)=1),1,0))","v":""},{"$f":"IFERROR(IF(T165=\"\",\"\",'Rating Formula'!J163),\"         -\")","v":""},160,null,null,"","","","","",null,"","","","","","",null,null,"","","",null,null,"","","","",160]
[null,null,null,null,null,null,null,null,null,null,null,null,null,null,null,null,null,"","","","",{"$f":"IF(OR(U166=\"\",ISBLANK($E$11)=TRUE),\"\",TRUNC((YEAR(Tables!$E$18)-YEAR(U166))+(MONTH(Tables!$E$18)-MONTH(U166))/12+0.92,0)-1+IF(AND(MONTH(Tables!$E$18)=MONTH(U166),DAY(U166)=1),1,0))","v":""},{"$f":"IFERROR(IF(T166=\"\",\"\",'Rating Formula'!J164),\"         -\")","v":""},161,null,null,{"$f":"IF(ISNUMBER(R166)=TRUE,R166,\"\")","v":""},{"$f":"IF(ISNUMBER(R166)=TRUE,S166,\"\")","v":""},{"$f":"IF(ISNUMBER(R166)=TRUE,IF(T166=\"D\",IF(V166>20,\"Z\",\"Y\"),T166),\"\")","v":""},{"$f":"IF(ISNUMBER(R166)=TRUE,U166,\"\")","v":""},{"$f":"IF(ISNUMBER(R166)=TRUE,V166,\"\")","v":""},null,"","","","","","",null,null,"","","",null,null,{"$f":"R166&T166","v":""},{"$f":"V166","v":""},{"$f":"W166","v":""},{"$f":"IF(S166=0,\"\",S166)","v":""},161]
[null,null,null,null,null,null,null,null,null,null,null,null,null,null,null,null,null,"","","","",{"$f":"IF(OR(U167=\"\",ISBLANK($E$11)=TRUE),\"\",TRUNC((YEAR(Tables!$E$18)-YEAR(U167))+(MONTH(Tables!$E$18)-MONTH(U167))/12+0.92,0)-1+IF(AND(MONTH(Tables!$E$18)=MONTH(U167),DAY(U167)=1),1,0))","v":""},{"$f":"IFERROR(IF(T167=\"\",\"\",'Rating Formula'!J165),\"         -\")","v":""},162,null,null,"","","","","",null,"","","","","","",null,null,"","","",null,null,"","","","",162]
[null,null,null,null,null,null,null,null,null,null,null,null,null,null,null,null,null,"","","","",{"$f":"IF(OR(U168=\"\",ISBLANK($E$11)=TRUE),\"\",TRUNC((YEAR(Tables!$E$18)-YEAR(U168))+(MONTH(Tables!$E$18)-MONTH(U168))/12+0.92,0)-1+IF(AND(MONTH(Tables!$E$18)=MONTH(U168),DAY(U168)=1),1,0))","v":""},{"$f":"IFERROR(IF(T168=\"\",\"\",'Rating Formula'!J166),\"         -\")","v":""},163,null,null,"","","","","",null,"","","","","","",null,null,"","","",null,null,"","","","",163]
[null,null,null,null,null,null,null,null,null,null,null,null,null,null,null,null,null,"","","","",{"$f":"IF(OR(U169=\"\",ISBLANK($E$11)=TRUE),\"\",TRUNC((YEAR(Tables!$E$18)-YEAR(U169))+(MONTH(Tables!$E$18)-MONTH(U169))/12+0.92,0)-1+IF(AND(MONTH(Tables!$E$18)=MONTH(U169),DAY(U169)=1),1,0))","v":""},{"$f":"IFERROR(IF(T169=\"\",\"\",'Rating Formula'!J167),\"         -\")","v":""},164,null,null,"","","","","",null,"","","","","","",null,null,"","","",null,null,"","","","",164]
[null,null,null,null,null,null,null,null,null,null,null,null,null,null,null,null,null,"","","","",{"$f":"IF(OR(U170=\"\",ISBLANK($E$11)=TRUE),\"\",TRUNC((YEAR(Tables!$E$18)-YEAR(U170))+(MONTH(Tables!$E$18)-MONTH(U170))/12+0.92,0)-1+IF(AND(MONTH(Tables!$E$18)=MONTH(U170),DAY(U170)=1),1,0))","v":""},{"$f":"IFERROR(IF(T170=\"\",\"\",'Rating Formula'!J168),\"         -\")","v":""},165,null,null,"","","","","",null,"","","","","","",null,null,"","","",null,null,"","","","",165]
[null,null,null,null,null,null,null,null,null,null,null,null,null,null,null,null,null,"","","","",{"$f":"IF(OR(U171=\"\",ISBLANK($E$11)=TRUE),\"\",TRUNC((YEAR(Tables!$E$18)-YEAR(U171))+(MONTH(Tables!$E$18)-MONTH(U171))/12+0.92,0)-1+IF(AND(MONTH(Tables!$E$18)=MONTH(U171),DAY(U171)=1),1,0))","v":""},{"$f":"IFERROR(IF(T171=\"\",\"\",'Rating Formula'!J169),\"         -\")","v":""},166,null,null,"","","","","",null,"","","","","","",null,null,"","","",null,null,"","","","",166]
[null,null,null,null,null,null,null,null,null,null,null,null,null,null,null,null,null,"","","","",{"$f":"IF(OR(U172=\"\",ISBLANK($E$11)=TRUE),\"\",TRUNC((YEAR(Tables!$E$18)-YEAR(U172))+(MONTH(Tables!$E$18)-MONTH(U172))/12+0.92,0)-1+IF(AND(MONTH(Tables!$E$18)=MONTH(U172),DAY(U172)=1),1,0))","v":""},{"$f":"IFERROR(IF(T172=\"\",\"\",'Rating Formula'!J170),\"         -\")","v":""},167,null,null,"","","","","",null,"","","","","","",null,null,"","","",null,null,"","","","",167]
[null,null,null,null,null,null,null,null,null,null,null,null,null,null,null,null,null,"","","","",{"$f":"IF(OR(U173=\"\",ISBLANK($E$11)=TRUE),\"\",TRUNC((YEAR(Tables!$E$18)-YEAR(U173))+(MONTH(Tables!$E$18)-MONTH(U173))/12+0.92,0)-1+IF(AND(MONTH(Tables!$E$18)=MONTH(U173),DAY(U173)=1),1,0))","v":""},{"$f":"IFERROR(IF(T173=\"\",\"\",'Rating Formula'!J171),\"         -\")","v":""},168,null,null,"","","","","",null,"","","","","","",null,null,"","","",null,null,"","","","",168]
[null,null,null,null,null,null,null,null,null,null,null,null,null,null,null,null,null,"","","","",{"$f":"IF(OR(U174=\"\",ISBLANK($E$11)=TRUE),\"\",TRUNC((YEAR(Tables!$E$18)-YEAR(U174))+(MONTH(Tables!$E$18)-MONTH(U174))/12+0.92,0)-1+IF(AND(MONTH(Tables!$E$18)=MONTH(U174),DAY(U174)=1),1,0))","v":""},{"$f":"IFERROR(IF(T174=\"\",\"\",'Rating Formula'!J172),\"         -\")","v":""},169,null,null,"","","","","",null,"","","","","","",null,null,"","","",null,null,"","","","",169]
[null,null,null,null,null,null,null,null,null,null,null,null,null,null,null,null,null,"","","","",{"$f":"IF(OR(U175=\"\",ISBLANK($E$11)=TRUE),\"\",TRUNC((YEAR(Tables!$E$18)-YEAR(U175))+(MONTH(Tables!$E$18)-MONTH(U175))/12+0.92,0)-1+IF(AND(MONTH(Tables!$E$18)=MONTH(U175),DAY(U175)=1),1,0))","v":""},{"$f":"IFERROR(IF(T175=\"\",\"\",'Rating Formula'!J173),\"         -\")","v":""},170,null,null,"","","","","",null,"","","","","","",null,null,"","","",null,null,"","","","",170]
[null,null,null,null,null,null,null,null,null,null,null,null,null,null,null,null,null,"","","","",{"$f":"IF(OR(U176=\"\",ISBLANK($E$11)=TRUE),\"\",TRUNC((YEAR(Tables!$E$18)-YEAR(U176))+(MONTH(Tables!$E$18)-MONTH(U176))/12+0.92,0)-1+IF(AND(MONTH(Tables!$E$18)=MONTH(U176),DAY(U176)=1),1,0))","v":""},{"$f":"IFERROR(IF(T176=\"\",\"\",'Rating Formula'!J174),\"         -\")","v":""},171,null,null,"","","","","",null,"","","","","","",null,null,"","","",null,null,"","","","",171]
[null,null,null,null,null,null,null,null,null,null,null,null,null,null,null,null,null,"","","","",{"$f":"IF(OR(U177=\"\",ISBLANK($E$11)=TRUE),\"\",TRUNC((YEAR(Tables!$E$18)-YEAR(U177))+(MONTH(Tables!$E$18)-MONTH(U177))/12+0.92,0)-1+IF(AND(MONTH(Tables!$E$18)=MONTH(U177),DAY(U177)=1),1,0))","v":""},{"$f":"IFERROR(IF(T177=\"\",\"\",'Rating Formula'!J175),\"         -\")","v":""},172,null,null,"","","","","",null,"","","","","","",null,null,"","","",null,null,"","","","",172]
[null,null,null,null,null,null,null,null,null,null,null,null,null,null,null,null,null,"","","","",{"$f":"IF(OR(U178=\"\",ISBLANK($E$11)=TRUE),\"\",TRUNC((YEAR(Tables!$E$18)-YEAR(U178))+(MONTH(Tables!$E$18)-MONTH(U178))/12+0.92,0)-1+IF(AND(MONTH(Tables!$E$18)=MONTH(U178),DAY(U178)=1),1,0))","v":""},{"$f":"IFERROR(IF(T178=\"\",\"\",'Rating Formula'!J176),\"         -\")","v":""},173,null,null,"","","","","",null,"","","","","","",null,null,"","","",null,null,"","","","",173]
[null,null,null,null,null,null,null,null,null,null,null,null,null,null,null,null,null,"","","","",{"$f":"IF(OR(U179=\"\",ISBLANK($E$11)=TRUE),\"\",TRUNC((YEAR(Tables!$E$18)-YEAR(U179))+(MONTH(Tables!$E$18)-MONTH(U179))/12+0.92,0)-1+IF(AND(MONTH(Tables!$E$18)=MONTH(U179),DAY(U179)=1),1,0))","v":""},{"$f":"IFERROR(IF(T179=\"\",\"\",'Rating Formula'!J177),\"         -\")","v":""},174,null,null,"","","","","",null,"","","","","","",null,null,"","","",null,null,"","","","",174]
[null,null,null,null,null,null,null,null,null,null,null,null,null,null,null,null,null,"","","","",{"$f":"IF(OR(U180=\"\",ISBLANK($E$11)=TRUE),\"\",TRUNC((YEAR(Tables!$E$18)-YEAR(U180))+(MONTH(Tables!$E$18)-MONTH(U180))/12+0.92,0)-1+IF(AND(MONTH(Tables!$E$18)=MONTH(U180),DAY(U180)=1),1,0))","v":""},{"$f":"IFERROR(IF(T180=\"\",\"\",'Rating Formula'!J178),\"         -\")","v":""},175,null,null,"","","","","",null,"","","","","","",null,null,"","","",null,null,"","","","",175]
[null,null,null,null,null,null,null,null,null,null,null,null,null,null,null,null,null,"","","","",{"$f":"IF(OR(U181=\"\",ISBLANK($E$11)=TRUE),\"\",TRUNC((YEAR(Tables!$E$18)-YEAR(U181))+(MONTH(Tables!$E$18)-MONTH(U181))/12+0.92,0)-1+IF(AND(MONTH(Tables!$E$18)=MONTH(U181),DAY(U181)=1),1,0))","v":""},{"$f":"IFERROR(IF(T181=\"\",\"\",'Rating Formula'!J179),\"         -\")","v":""},176,null,null,"","","","","",null,"","","","","","",null,null,"","","",null,null,"","","","",176]
[null,null,null,null,null,null,null,null,null,null,null,null,null,null,null,null,null,"","","","",{"$f":"IF(OR(U182=\"\",ISBLANK($E$11)=TRUE),\"\",TRUNC((YEAR(Tables!$E$18)-YEAR(U182))+(MONTH(Tables!$E$18)-MONTH(U182))/12+0.92,0)-1+IF(AND(MONTH(Tables!$E$18)=MONTH(U182),DAY(U182)=1),1,0))","v":""},{"$f":"IFERROR(IF(T182=\"\",\"\",'Rating Formula'!J180),\"         -\")","v":""},177,null,null,"","","","","",null,"","","","","","",null,null,"","","",null,null,"","","","",177]
[null,null,null,null,null,null,null,null,null,null,null,null,null,null,null,null,null,"","","","",{"$f":"IF(OR(U183=\"\",ISBLANK($E$11)=TRUE),\"\",TRUNC((YEAR(Tables!$E$18)-YEAR(U183))+(MONTH(Tables!$E$18)-MONTH(U183))/12+0.92,0)-1+IF(AND(MONTH(Tables!$E$18)=MONTH(U183),DAY(U183)=1),1,0))","v":""},{"$f":"IFERROR(IF(T183=\"\",\"\",'Rating Formula'!J181),\"         -\")","v":""},178,null,null,"","","","","",null,"","","","","","",null,null,"","","",null,null,"","","","",178]
[null,null,null,null,null,null,null,null,null,null,null,null,null,null,null,null,null,"","","","",{"$f":"IF(OR(U184=\"\",ISBLANK($E$11)=TRUE),\"\",TRUNC((YEAR(Tables!$E$18)-YEAR(U184))+(MONTH(Tables!$E$18)-MONTH(U184))/12+0.92,0)-1+IF(AND(MONTH(Tables!$E$18)=MONTH(U184),DAY(U184)=1),1,0))","v":""},{"$f":"IFERROR(IF(T184=\"\",\"\",'Rating Formula'!J182),\"         -\")","v":""},179,null,null,"","","","","",null,"","","","","","",null,null,"","","",null,null,"","","","",179]
[null,null,null,null,null,null,null,null,null,null,null,null,null,null,null,null,null,"","","","",{"$f":"IF(OR(U185=\"\",ISBLANK($E$11)=TRUE),\"\",TRUNC((YEAR(Tables!$E$18)-YEAR(U185))+(MONTH(Tables!$E$18)-MONTH(U185))/12+0.92,0)-1+IF(AND(MONTH(Tables!$E$18)=MONTH(U185),DAY(U185)=1),1,0))","v":""},{"$f":"IFERROR(IF(T185=\"\",\"\",'Rating Formula'!J183),\"         -\")","v":""},180,null,null,"","","","","",null,"","","","","","",null,null,"","","",null,null,"","","","",180]
[null,null,null,null,null,null,null,null,null,null,null,null,null,null,null,null,null,"","","","",{"$f":"IF(OR(U186=\"\",ISBLANK($E$11)=TRUE),\"\",TRUNC((YEAR(Tables!$E$18)-YEAR(U186))+(MONTH(Tables!$E$18)-MONTH(U186))/12+0.92,0)-1+IF(AND(MONTH(Tables!$E$18)=MONTH(U186),DAY(U186)=1),1,0))","v":""},{"$f":"IFERROR(IF(T186=\"\",\"\",'Rating Formula'!J184),\"         -\")","v":""},181,null,null,"","","","","",null,"","","","","","",null,null,"","","",null,null,"","","","",181]
[null,null,null,null,null,null,null,null,null,null,null,null,null,null,null,null,null,"","","","",{"$f":"IF(OR(U187=\"\",ISBLANK($E$11)=TRUE),\"\",TRUNC((YEAR(Tables!$E$18)-YEAR(U187))+(MONTH(Tables!$E$18)-MONTH(U187))/12+0.92,0)-1+IF(AND(MONTH(Tables!$E$18)=MONTH(U187),DAY(U187)=1),1,0))","v":""},{"$f":"IFERROR(IF(T187=\"\",\"\",'Rating Formula'!J185),\"         -\")","v":""},182,null,null,"","","","","",null,"","","","","","",null,null,"","","",null,null,"","","","",182]
[null,null,null,null,null,null,null,null,null,null,null,null,null,null,null,null,null,{"$f":"IF(T188=\"\",\"\",IF(T188=\"E\",R187+1,R187))","v":""},"","","",{"$f":"IF(OR(U188=\"\",ISBLANK($E$11)=TRUE),\"\",TRUNC((YEAR(Tables!$E$18)-YEAR(U188))+(MONTH(Tables!$E$18)-MONTH(U188))/12+0.92,0)-1+IF(AND(MONTH(Tables!$E$18)=MONTH(U188),DAY(U188)=1),1,0))","v":""},{"$f":"IFERROR(IF(T188=\"\",\"\",'Rating Formula'!J186),\"         -\")","v":""},183,null,null,"","","","","",null,"","","","","","",null,null,"","","",null,null,"","","","",183]
[null,null,null,null,null,null,null,null,null,null,null,null,null,null,null,null,null,"","","","",{"$f":"IF(OR(U189=\"\",ISBLANK($E$11)=TRUE),\"\",TRUNC((YEAR(Tables!$E$18)-YEAR(U189))+(MONTH(Tables!$E$18)-MONTH(U189))/12+0.92,0)-1+IF(AND(MONTH(Tables!$E$18)=MONTH(U189),DAY(U189)=1),1,0))","v":""},{"$f":"IFERROR(IF(T189=\"\",\"\",'Rating Formula'!J187),\"         -\")","v":""},184,null,null,"","","","","",null,"","","","","","",null,null,"","","",null,null,"","","","",184]
[null,null,null,null,null,null,null,null,null,null,null,null,null,null,null,null,null,"","","","",{"$f":"IF(OR(U190=\"\",ISBLANK($E$11)=TRUE),\"\",TRUNC((YEAR(Tables!$E$18)-YEAR(U190))+(MONTH(Tables!$E$18)-MONTH(U190))/12+0.92,0)-1+IF(AND(MONTH(Tables!$E$18)=MONTH(U190),DAY(U190)=1),1,0))","v":""},{"$f":"IFERROR(IF(T190=\"\",\"\",'Rating Formula'!J188),\"         -\")","v":""},185,null,null,"","","","","",null,"","","","","","",null,null,"","","",null,null,"","","","",185]
[null,null,null,null,null,null,null,null,null,null,null,null,null,null,null,null,null,"","","","",{"$f":"IF(OR(U191=\"\",ISBLANK($E$11)=TRUE),\"\",TRUNC((YEAR(Tables!$E$18)-YEAR(U191))+(MONTH(Tables!$E$18)-MONTH(U191))/12+0.92,0)-1+IF(AND(MONTH(Tables!$E$18)=MONTH(U191),DAY(U191)=1),1,0))","v":""},{"$f":"IFERROR(IF(T191=\"\",\"\",'Rating Formula'!J189),\"         -\")","v":""},186,null,null,"","","","","",null,"","","","","","",null,null,"","","",null,null,"","","","",186]
[null,null,null,null,null,null,null,null,null,null,null,null,null,null,null,null,null,"","","","",{"$f":"IF(OR(U192=\"\",ISBLANK($E$11)=TRUE),\"\",TRUNC((YEAR(Tables!$E$18)-YEAR(U192))+(MONTH(Tables!$E$18)-MONTH(U192))/12+0.92,0)-1+IF(AND(MONTH(Tables!$E$18)=MONTH(U192),DAY(U192)=1),1,0))","v":""},{"$f":"IFERROR(IF(T192=\"\",\"\",'Rating Formula'!J190),\"         -\")","v":""},187,null,null,"","","","","",null,{"$f":"IF(AH192=\"\",\"\",IF(AJ192=\"Y\",AG191+1,0))","v":""},"","","","","",null,null,{"$f":"IF(AI192=\"\",\"\",AI192)","v":""},{"$f":"IF(OR(AJ192=\"Y\",AJ192=\"Z\"),\"D\",UPPER(AJ192))","v":""},{"$f":"IF(AK192=\"\",\"\",AK192)","v":""},null,null,{"$f":"R192&T192","v":""},{"$f":"V192","v":""},{"$f":"W192","v":""},{"$f":"IF(S192=0,\"\",S192)","v":""},187]
[null,null,null,null,null,null,null,null,null,null,null,null,null,null,null,null,null,"","","","",{"$f":"IF(OR(U193=\"\",ISBLANK($E$11)=TRUE),\"\",TRUNC((YEAR(Tables!$E$18)-YEAR(U193))+(MONTH(Tables!$E$18)-MONTH(U193))/12+0.92,0)-1+IF(AND(MONTH(Tables!$E$18)=MONTH(U193),DAY(U193)=1),1,0))","v":""},{"$f":"IFERROR(IF(T193=\"\",\"\",'Rating Formula'!J191),\"         -\")","v":""},188,null,null,"","","","","",null,"","","","","","",null,null,"","","",null,null,"","","","",188]
[null,null,null,null,null,null,null,null,null,null,null,null,null,null,null,null,null,"","","","",{"$f":"IF(OR(U194=\"\",ISBLANK($E$11)=TRUE),\"\",TRUNC((YEAR(Tables!$E$18)-YEAR(U194))+(MONTH(Tables!$E$18)-MONTH(U194))/12+0.92,0)-1+IF(AND(MONTH(Tables!$E$18)=MONTH(U194),DAY(U194)=1),1,0))","v":""},{"$f":"IFERROR(IF(T194=\"\",\"\",'Rating Formula'!J192),\"         -\")","v":""},189,null,null,"","","","","",null,"","","","","","",null,null,"","","",null,null,"","","","",189]
[null,null,null,null,null,null,null,null,null,null,null,null,null,null,null,null,null,"","","","",{"$f":"IF(OR(U195=\"\",ISBLANK($E$11)=TRUE),\"\",TRUNC((YEAR(Tables!$E$18)-YEAR(U195))+(MONTH(Tables!$E$18)-MONTH(U195))/12+0.92,0)-1+IF(AND(MONTH(Tables!$E$18)=MONTH(U195),DAY(U195)=1),1,0))","v":""},{"$f":"IFERROR(IF(T195=\"\",\"\",'Rating Formula'!J193),\"         -\")","v":""},190,null,null,"","","","","",null,"","","","","","",null,null,"","","",null,null,"","","","",190]
["end","end","end","end","end","end","end","end","end","end","end","end","end","end","end","end","end","end","end","end","end","end","end","end","end","end","end","end","end","end","end","end","end","end","end","end","end","end",null,"end","end","end","end","end","end","end","end","end","end","end"]
[]
[null,null,null,null,null,null,null,null,null,null,null,null,null,null,null,null,null,null,null,null,null,null,null,null,null,null,"hide","hide","hide","hide","hide","hide","hide","hide","hide","hide","hide","hide","hide","hide","hide","hide","hide","hide","hide","hide","hide","hide","hide","hide"]
[null,null,null,null,null,null,null,null,null,null,null,null,null,null,null,null,null,null,null,null,null,null,null,null,null,null,null,"in from Census Entry display; COPY to right",null,null,null,null,null,null,"SORT Census Enty Data",null,null,null,null,null,"convert subscriber type back to normal and COPY back to Census Entry area"]
[null,null,null,null,null,null,null,null,null,null,null,null,null,null,null,null,null,null,null,null,null,null,null,null,null,null,null,"Y = dependents < 21 ;  max of 3",null,null,null,null,null,null,"Y = dependents < 21 ;  max of 3 (oldest)"]
[null,null,null,null,null,null,null,null,null,null,null,null,null,null,null,null,null,null,null,null,null,null,null,null,null,null,null,"Z = dependents >= 21",null,null,null,null,null,null,"Z = dependents >= 21"]

{"sheet":"Group Rate Summary","index":2,"n_rows":66,"n_cols":12,"rows_kept":66,"cut":false,"hidden":false,"merged":[[7,1,7,9],[1,1,1,6],[2,1,2,6],[4,1,4,9],[5,1,5,9],[6,1,6,9]]}
[null,{"$f":"Input!B1","v":" VERSION 1 2025"},null,null,null,null,null,null,null,null,null,"Hide"]
[null,{"$f":"IF(Input!E9=\"\",\"\",Input!E9)","v":""}]
[null,{"$f":"\"Effective \"&Input!E11","v":"Effective "}]
[]
[null,{"$f":"Tables!B4&\" Employee Premium Rate Summary\"","v":"WPS Employee Premium Rate Summary"}]
[null,{"$f":"IF(Tables!B4=\"WPS\",\"PLAN - \"&Tables!B4&\" \"&Tables!C15&\" \"&Input!E17&\" (HIOS ID: \"&Input!L13&\")                   COUNTY: \"&PROPER(Input!E13),\"PLAN - \"&Tables!B4&\" \"&Input!E17&\" (HIOS ID: \"&Input!L13&\")           COUNTY: \"&PROPER(Input!E13))","v":"PLAN - WPS 0  (HIOS ID: )                   COUNTY: "}]
[null,{"$f":"IF(Input!G21=\"no cvrge\",\"DEDUCTIBLE: $\"&TEXT(Input!E21,\"##,###\")&\" \"&Tables!B36&\"      COINSURANCE: \"&Input!E22&\"      OUT-OF-POCKET: $\"&TEXT(Input!E23,\"##,###\"),\"DEDUCTIBLE: $\"&TEXT(Input!E21,\"##,###\")&\"/$\"&TEXT(Input!G21,\"##,###\")&\" \"&Tables!B36&\"      COINSURANCE: \"&Input!E22&\"/\"&Input!G22&\"      OUT-OF-POCKET: $\"&TEXT(Input!E23,\"##,###\")&\"/$\"&TEXT(Input!G23,\"##,###\"))","v":{"$error":"#N/A"}}]
[null,{"$f":"\"COPAYS -  ER: \"&Tables!B33&Input!L24&\"  |  Teledoc: \"&Tables!B33&Input!L20&\"  |  Retail: \"&Tables!B33&Input!L21&\"  |  PCP: \"&Tables!B33&Input!L22&\"  |  Spcl: \"&Tables!B33&Input!L23&\"  |  Prev Care: $0  |  Rx: \"&Tables!B34","v":{"$error":"#N/A"}}]
[]
[]
[null,null,null,"Employee","Employee",null,"Coverage","Employee"]
[null,null,null,"Number","Name","Age","Type","Rate"]
[]
[null,null,null,"Group Total",null,null,null,{"$f":"SUM(H16:H65)","v":0}]
[]
[null,null,null,1,{"$f":"IF('Output for PDFs'!L15=\"\",\"\",'Output for PDFs'!L15)","v":""},{"$f":"IF('Output for PDFs'!M15=0,\"\",'Output for PDFs'!M15)","v":""},{"$f":"'Output for PDFs'!E15","v":""},{"$f":"IF(D16=\"\",\"\",SUMIF(Input!$R$6:$R$195,D16,Input!$W$6:$W$195))","v":0}]
[null,null,null,{"$f":"IF(E17=\"\",\"\",D16+1)","v":""},{"$f":"IF('Output for PDFs'!L16=\"\",\"\",'Output for PDFs'!L16)","v":""},{"$f":"IF('Output for PDFs'!M16=0,\"\",'Output for PDFs'!M16)","v":""},{"$f":"'Output for PDFs'!E16","v":""},{"$f":"IF(D17=\"\",\"\",SUMIF(Input!$R$6:$R$195,D17,Input!$W$6:$W$195))","v":""}]
[null,null,null,{"$f":"IF(E18=\"\",\"\",D17+1)","v":""},{"$f":"IF('Output for PDFs'!L17=\"\",\"\",'Output for PDFs'!L17)","v":""},{"$f":"IF('Output for PDFs'!M17=0,\"\",'Output for PDFs'!M17)","v":""},{"$f":"'Output for PDFs'!E17","v":""},{"$f":"IF(D18=\"\",\"\",SUMIF(Input!$R$6:$R$195,D18,Input!$W$6:$W$195))","v":""}]
[null,null,null,"",{"$f":"IF('Output for PDFs'!L18=\"\",\"\",'Output for PDFs'!L18)","v":""},{"$f":"IF('Output for PDFs'!M18=0,\"\",'Output for PDFs'!M18)","v":""},{"$f":"'Output for PDFs'!E18","v":""},{"$f":"IF(D19=\"\",\"\",SUMIF(Input!$R$6:$R$195,D19,Input!$W$6:$W$195))","v":""}]
[null,null,null,"",{"$f":"IF('Output for PDFs'!L19=\"\",\"\",'Output for PDFs'!L19)","v":""},{"$f":"IF('Output for PDFs'!M19=0,\"\",'Output for PDFs'!M19)","v":""},{"$f":"'Output for PDFs'!E19","v":""},{"$f":"IF(D20=\"\",\"\",SUMIF(Input!$R$6:$R$195,D20,Input!$W$6:$W$195))","v":""}]
[null,null,null,"",{"$f":"IF('Output for PDFs'!L20=\"\",\"\",'Output for PDFs'!L20)","v":""},{"$f":"IF('Output for PDFs'!M20=0,\"\",'Output for PDFs'!M20)","v":""},{"$f":"'Output for PDFs'!E20","v":""},{"$f":"IF(D21=\"\",\"\",SUMIF(Input!$R$6:$R$195,D21,Input!$W$6:$W$195))","v":""}]
[null,null,null,"",{"$f":"IF('Output for PDFs'!L21=\"\",\"\",'Output for PDFs'!L21)","v":""},{"$f":"IF('Output for PDFs'!M21=0,\"\",'Output for PDFs'!M21)","v":""},{"$f":"'Output for PDFs'!E21","v":""},{"$f":"IF(D22=\"\",\"\",SUMIF(Input!$R$6:$R$195,D22,Input!$W$6:$W$195))","v":""}]
[null,null,null,"",{"$f":"IF('Output for PDFs'!L22=\"\",\"\",'Output for PDFs'!L22)","v":""},{"$f":"IF('Output for PDFs'!M22=0,\"\",'Output for PDFs'!M22)","v":""},{"$f":"'Output for PDFs'!E22","v":""},{"$f":"IF(D23=\"\",\"\",SUMIF(Input!$R$6:$R$195,D23,Input!$W$6:$W$195))","v":""}]
[null,null,null,"",{"$f":"IF('Output for PDFs'!L23=\"\",\"\",'Output for PDFs'!L23)","v":""},{"$f":"IF('Output for PDFs'!M23=0,\"\",'Output for PDFs'!M23)","v":""},{"$f":"'Output for PDFs'!E23","v":""},{"$f":"IF(D24=\"\",\"\",SUMIF(Input!$R$6:$R$195,D24,Input!$W$6:$W$195))","v":""}]
[null,null,null,"",{"$f":"IF('Output for PDFs'!L24=\"\",\"\",'Output for PDFs'!L24)","v":""},{"$f":"IF('Output for PDFs'!M24=0,\"\",'Output for PDFs'!M24)","v":""},{"$f":"'Output for PDFs'!E24","v":""},{"$f":"IF(D25=\"\",\"\",SUMIF(Input!$R$6:$R$195,D25,Input!$W$6:$W$195))","v":""}]
[null,null,null,"",{"$f":"IF('Output for PDFs'!L25=\"\",\"\",'Output for PDFs'!L25)","v":""},{"$f":"IF('Output for PDFs'!M25=0,\"\",'Output for PDFs'!M25)","v":""},{"$f":"'Output for PDFs'!E25","v":""},{"$f":"IF(D26=\"\",\"\",SUMIF(Input!$R$6:$R$195,D26,Input!$W$6:$W$195))","v":""}]
[null,null,null,"",{"$f":"IF('Output for PDFs'!L26=\"\",\"\",'Output for PDFs'!L26)","v":""},{"$f":"IF('Output for PDFs'!M26=0,\"\",'Output for PDFs'!M26)","v":""},{"$f":"'Output for PDFs'!E26","v":""},{"$f":"IF(D27=\"\",\"\",SUMIF(Input!$R$6:$R$195,D27,Input!$W$6:$W$195))","v":""}]
[null,null,null,"",{"$f":"IF('Output for PDFs'!L27=\"\",\"\",'Output for PDFs'!L27)","v":""},{"$f":"IF('Output for PDFs'!M27=0,\"\",'Output for PDFs'!M27)","v":""},{"$f":"'Output for PDFs'!E27","v":""},{"$f":"IF(D28=\"\",\"\",SUMIF(Input!$R$6:$R$195,D28,Input!$W$6:$W$195))","v":""}]
[null,null,null,"",{"$f":"IF('Output for PDFs'!L28=\"\",\"\",'Output for PDFs'!L28)","v":""},{"$f":"IF('Output for PDFs'!M28=0,\"\",'Output for PDFs'!M28)","v":""},{"$f":"'Output for PDFs'!E28","v":""},{"$f":"IF(D29=\"\",\"\",SUMIF(Input!$R$6:$R$195,D29,Input!$W$6:$W$195))","v":""}]
[null,null,null,"",{"$f":"IF('Output for PDFs'!L29=\"\",\"\",'Output for PDFs'!L29)","v":""},{"$f":"IF('Output for PDFs'!M29=0,\"\",'Output for PDFs'!M29)","v":""},{"$f":"'Output for PDFs'!E29","v":""},{"$f":"IF(D30=\"\",\"\",SUMIF(Input!$R$6:$R$195,D30,Input!$W$6:$W$195))","v":""}]
[null,null,null,"",{"$f":"IF('Output for PDFs'!L30=\"\",\"\",'Output for PDFs'!L30)","v":""},{"$f":"IF('Output for PDFs'!M30=0,\"\",'Output for PDFs'!M30)","v":""},{"$f":"'Output for PDFs'!E30","v":""},{"$f":"IF(D31=\"\",\"\",SUMIF(Input!$R$6:$R$195,D31,Input!$W$6:$W$195))","v":""}]
[null,null,null,"",{"$f":"IF('Output for PDFs'!L31=\"\",\"\",'Output for PDFs'!L31)","v":""},{"$f":"IF('Output for PDFs'!M31=0,\"\",'Output for PDFs'!M31)","v":""},{"$f":"'Output for PDFs'!E31","v":""},{"$f":"IF(D32=\"\",\"\",SUMIF(Input!$R$6:$R$195,D32,Input!$W$6:$W$195))","v":""}]
[null,null,null,"",{"$f":"IF('Output for PDFs'!L32=\"\",\"\",'Output for PDFs'!L32)","v":""},{"$f":"IF('Output for PDFs'!M32=0,\"\",'Output for PDFs'!M32)","v":""},{"$f":"'Output for PDFs'!E32","v":""},{"$f":"IF(D33=\"\",\"\",SUMIF(Input!$R$6:$R$195,D33,Input!$W$6:$W$195))","v":""}]
[null,null,null,"",{"$f":"IF('Output for PDFs'!L33=\"\",\"\",'Output for PDFs'!L33)","v":""},{"$f":"IF('Output for PDFs'!M33=0,\"\",'Output for PDFs'!M33)","v":""},{"$f":"'Output for PDFs'!E33","v":""},{"$f":"IF(D34=\"\",\"\",SUMIF(Input!$R$6:$R$195,D34,Input!$W$6:$W$195))","v":""}]
[null,null,null,"",{"$f":"IF('Output for PDFs'!L34=\"\",\"\",'Output for PDFs'!L34)","v":""},{"$f":"IF('Output for PDFs'!M34=0,\"\",'Output for PDFs'!M34)","v":""},{"$f":"'Output for PDFs'!E34","v":""},{"$f":"IF(D35=\"\",\"\",SUMIF(Input!$R$6:$R$195,D35,Input!$W$6:$W$195))","v":""}]
[null,null,null,"",{"$f":"IF('Output for PDFs'!L35=\"\",\"\",'Output for PDFs'!L35)","v":""},{"$f":"IF('Output for PDFs'!M35=0,\"\",'Output for PDFs'!M35)","v":""},{"$f":"'Output for PDFs'!E35","v":""},{"$f":"IF(D36=\"\",\"\",SUMIF(Input!$R$6:$R$195,D36,Input!$W$6:$W$195))","v":""}]
[null,null,null,"",{"$f":"IF('Output for PDFs'!L36=\"\",\"\",'Output for PDFs'!L36)","v":""},{"$f":"IF('Output for PDFs'!M36=0,\"\",'Output for PDFs'!M36)","v":""},{"$f":"'Output for PDFs'!E36","v":""},{"$f":"IF(D37=\"\",\"\",SUMIF(Input!$R$6:$R$195,D37,Input!$W$6:$W$195))","v":""}]
[null,null,null,"",{"$f":"IF('Output for PDFs'!L37=\"\",\"\",'Output for PDFs'!L37)","v":""},{"$f":"IF('Output for PDFs'!M37=0,\"\",'Output for PDFs'!M37)","v":""},{"$f":"'Output for PDFs'!E37","v":""},{"$f":"IF(D38=\"\",\"\",SUMIF(Input!$R$6:$R$195,D38,Input!$W$6:$W$195))","v":""}]
[null,null,null,"",{"$f":"IF('Output for PDFs'!L38=\"\",\"\",'Output for PDFs'!L38)","v":""},{"$f":"IF('Output for PDFs'!M38=0,\"\",'Output for PDFs'!M38)","v":""},{"$f":"'Output for PDFs'!E38","v":""},{"$f":"IF(D39=\"\",\"\",SUMIF(Input!$R$6:$R$195,D39,Input!$W$6:$W$195))","v":""}]
[null,null,null,"",{"$f":"IF('Output for PDFs'!L39=\"\",\"\",'Output for PDFs'!L39)","v":""},{"$f":"IF('Output for PDFs'!M39=0,\"\",'Output for PDFs'!M39)","v":""},{"$f":"'Output for PDFs'!E39","v":""},{"$f":"IF(D40=\"\",\"\",SUMIF(Input!$R$6:$R$195,D40,Input!$W$6:$W$195))","v":""}]
[null,null,null,"",{"$f":"IF('Output for PDFs'!L40=\"\",\"\",'Output for PDFs'!L40)","v":""},{"$f":"IF('Output for PDFs'!M40=0,\"\",'Output for PDFs'!M40)","v":""},{"$f":"'Output for PDFs'!E40","v":""},{"$f":"IF(D41=\"\",\"\",SUMIF(Input!$R$6:$R$195,D41,Input!$W$6:$W$195))","v":""}]
[null,null,null,"",{"$f":"IF('Output for PDFs'!L41=\"\",\"\",'Output for PDFs'!L41)","v":""},{"$f":"IF('Output for PDFs'!M41=0,\"\",'Output for PDFs'!M41)","v":""},{"$f":"'Output for PDFs'!E41","v":""},{"$f":"IF(D42=\"\",\"\",SUMIF(Input!$R$6:$R$195,D42,Input!$W$6:$W$195))","v":""}]
[null,null,null,"",{"$f":"IF('Output for PDFs'!L42=\"\",\"\",'Output for PDFs'!L42)","v":""},{"$f":"IF('Output for PDFs'!M42=0,\"\",'Output for PDFs'!M42)","v":""},{"$f":"'Output for PDFs'!E42","v":""},{"$f":"IF(D43=\"\",\"\",SUMIF(Input!$R$6:$R$195,D43,Input!$W$6:$W$195))","v":""}]
[null,null,null,"",{"$f":"IF('Output for PDFs'!L43=\"\",\"\",'Output for PDFs'!L43)","v":""},{"$f":"IF('Output for PDFs'!M43=0,\"\",'Output for PDFs'!M43)","v":""},{"$f":"'Output for PDFs'!E43","v":""},{"$f":"IF(D44=\"\",\"\",SUMIF(Input!$R$6:$R$195,D44,Input!$W$6:$W$195))","v":""}]
[null,null,null,"",{"$f":"IF('Output for PDFs'!L44=\"\",\"\",'Output for PDFs'!L44)","v":""},{"$f":"IF('Output for PDFs'!M44=0,\"\",'Output for PDFs'!M44)","v":""},{"$f":"'Output for PDFs'!E44","v":""},{"$f":"IF(D45=\"\",\"\",SUMIF(Input!$R$6:$R$195,D45,Input!$W$6:$W$195))","v":""}]
[null,null,null,"",{"$f":"IF('Output for PDFs'!L45=\"\",\"\",'Output for PDFs'!L45)","v":""},{"$f":"IF('Output for PDFs'!M45=0,\"\",'Output for PDFs'!M45)","v":""},{"$f":"'Output for PDFs'!E45","v":""},{"$f":"IF(D46=\"\",\"\",SUMIF(Input!$R$6:$R$195,D46,Input!$W$6:$W$195))","v":""}]
[null,null,null,"",{"$f":"IF('Output for PDFs'!L46=\"\",\"\",'Output for PDFs'!L46)","v":""},{"$f":"IF('Output for PDFs'!M46=0,\"\",'Output for PDFs'!M46)","v":""},{"$f":"'Output for PDFs'!E46","v":""},{"$f":"IF(D47=\"\",\"\",SUMIF(Input!$R$6:$R$195,D47,Input!$W$6:$W$195))","v":""}]
[null,null,null,"",{"$f":"IF('Output for PDFs'!L47=\"\",\"\",'Output for PDFs'!L47)","v":""},{"$f":"IF('Output for PDFs'!M47=0,\"\",'Output for PDFs'!M47)","v":""},{"$f":"'Output for PDFs'!E47","v":""},{"$f":"IF(D48=\"\",\"\",SUMIF(Input!$R$6:$R$195,D48,Input!$W$6:$W$195))","v":""}]
[null,null,null,"",{"$f":"IF('Output for PDFs'!L48=\"\",\"\",'Output for PDFs'!L48)","v":""},{"$f":"IF('Output for PDFs'!M48=0,\"\",'Output for PDFs'!M48)","v":""},{"$f":"'Output for PDFs'!E48","v":""},{"$f":"IF(D49=\"\",\"\",SUMIF(Input!$R$6:$R$195,D49,Input!$W$6:$W$195))","v":""}]
[null,null,null,"",{"$f":"IF('Output for PDFs'!L49=\"\",\"\",'Output for PDFs'!L49)","v":""},{"$f":"IF('Output for PDFs'!M49=0,\"\",'Output for PDFs'!M49)","v":""},{"$f":"'Output for PDFs'!E49","v":""},{"$f":"IF(D50=\"\",\"\",SUMIF(Input!$R$6:$R$195,D50,Input!$W$6:$W$195))","v":""}]
[null,null,null,"",{"$f":"IF('Output for PDFs'!L50=\"\",\"\",'Output for PDFs'!L50)","v":""},{"$f":"IF('Output for PDFs'!M50=0,\"\",'Output for PDFs'!M50)","v":""},{"$f":"'Output for PDFs'!E50","v":""},{"$f":"IF(D51=\"\",\"\",SUMIF(Input!$R$6:$R$195,D51,Input!$W$6:$W$195))","v":""}]
[null,null,null,"",{"$f":"IF('Output for PDFs'!L51=\"\",\"\",'Output for PDFs'!L51)","v":""},{"$f":"IF('Output for PDFs'!M51=0,\"\",'Output for PDFs'!M51)","v":""},{"$f":"'Output for PDFs'!E51","v":""},{"$f":"IF(D52=\"\",\"\",SUMIF(Input!$R$6:$R$195,D52,Input!$W$6:$W$195))","v":""}]
[null,null,null,"",{"$f":"IF('Output for PDFs'!L52=\"\",\"\",'Output for PDFs'!L52)","v":""},{"$f":"IF('Output for PDFs'!M52=0,\"\",'Output for PDFs'!M52)","v":""},{"$f":"'Output for PDFs'!E52","v":""},{"$f":"IF(D53=\"\",\"\",SUMIF(Input!$R$6:$R$195,D53,Input!$W$6:$W$195))","v":""}]
[null,null,null,"",{"$f":"IF('Output for PDFs'!L53=\"\",\"\",'Output for PDFs'!L53)","v":""},{"$f":"IF('Output for PDFs'!M53=0,\"\",'Output for PDFs'!M53)","v":""},{"$f":"'Output for PDFs'!E53","v":""},{"$f":"IF(D54=\"\",\"\",SUMIF(Input!$R$6:$R$195,D54,Input!$W$6:$W$195))","v":""}]
[null,null,null,"",{"$f":"IF('Output for PDFs'!L54=\"\",\"\",'Output for PDFs'!L54)","v":""},{"$f":"IF('Output for PDFs'!M54=0,\"\",'Output for PDFs'!M54)","v":""},{"$f":"'Output for PDFs'!E54","v":""},{"$f":"IF(D55=\"\",\"\",SUMIF(Input!$R$6:$R$195,D55,Input!$W$6:$W$195))","v":""}]
[null,null,null,"",{"$f":"IF('Output for PDFs'!L55=\"\",\"\",'Output for PDFs'!L55)","v":""},{"$f":"IF('Output for PDFs'!M55=0,\"\",'Output for PDFs'!M55)","v":""},{"$f":"'Output for PDFs'!E55","v":""},{"$f":"IF(D56=\"\",\"\",SUMIF(Input!$R$6:$R$195,D56,Input!$W$6:$W$195))","v":""}]
[null,null,null,"",{"$f":"IF('Output for PDFs'!L56=\"\",\"\",'Output for PDFs'!L56)","v":""},{"$f":"IF('Output for PDFs'!M56=0,\"\",'Output for PDFs'!M56)","v":""},{"$f":"'Output for PDFs'!E56","v":""},{"$f":"IF(D57=\"\",\"\",SUMIF(Input!$R$6:$R$195,D57,Input!$W$6:$W$195))","v":""},null,null,null,"last line on page 1 short"]
[null,null,null,"",{"$f":"IF('Output for PDFs'!L57=\"\",\"\",'Output for PDFs'!L57)","v":""},{"$f":"IF('Output for PDFs'!M57=0,\"\",'Output for PDFs'!M57)","v":""},{"$f":"'Output for PDFs'!E57","v":""},{"$f":"IF(D58=\"\",\"\",SUMIF(Input!$R$6:$R$195,D58,Input!$W$6:$W$195))","v":""}]
[null,null,null,"",{"$f":"IF('Output for PDFs'!L58=\"\",\"\",'Output for PDFs'!L58)","v":""},{"$f":"IF('Output for PDFs'!M58=0,\"\",'Output for PDFs'!M58)","v":""},{"$f":"'Output for PDFs'!E58","v":""},{"$f":"IF(D59=\"\",\"\",SUMIF(Input!$R$6:$R$195,D59,Input!$W$6:$W$195))","v":""}]
[null,null,null,"",{"$f":"IF('Output for PDFs'!L59=\"\",\"\",'Output for PDFs'!L59)","v":""},{"$f":"IF('Output for PDFs'!M59=0,\"\",'Output for PDFs'!M59)","v":""},{"$f":"'Output for PDFs'!E59","v":""},{"$f":"IF(D60=\"\",\"\",SUMIF(Input!$R$6:$R$195,D60,Input!$W$6:$W$195))","v":""}]
[null,null,null,"",{"$f":"IF('Output for PDFs'!L60=\"\",\"\",'Output for PDFs'!L60)","v":""},{"$f":"IF('Output for PDFs'!M60=0,\"\",'Output for PDFs'!M60)","v":""},{"$f":"'Output for PDFs'!E60","v":""},{"$f":"IF(D61=\"\",\"\",SUMIF(Input!$R$6:$R$195,D61,Input!$W$6:$W$195))","v":""}]
[null,null,null,"",{"$f":"IF('Output for PDFs'!L61=\"\",\"\",'Output for PDFs'!L61)","v":""},{"$f":"IF('Output for PDFs'!M61=0,\"\",'Output for PDFs'!M61)","v":""},{"$f":"'Output for PDFs'!E61","v":""},{"$f":"IF(D62=\"\",\"\",SUMIF(Input!$R$6:$R$195,D62,Input!$W$6:$W$195))","v":""}]
[null,null,null,"",{"$f":"IF('Output for PDFs'!L62=\"\",\"\",'Output for PDFs'!L62)","v":""},{"$f":"IF('Output for PDFs'!M62=0,\"\",'Output for PDFs'!M62)","v":""},{"$f":"'Output for PDFs'!E62","v":""},{"$f":"IF(D63=\"\",\"\",SUMIF(Input!$R$6:$R$195,D63,Input!$W$6:$W$195))","v":""}]
[null,null,null,"",{"$f":"IF('Output for PDFs'!L63=\"\",\"\",'Output for PDFs'!L63)","v":""},{"$f":"IF('Output for PDFs'!M63=0,\"\",'Output for PDFs'!M63)","v":""},{"$f":"'Output for PDFs'!E63","v":""},{"$f":"IF(D64=\"\",\"\",SUMIF(Input!$R$6:$R$195,D64,Input!$W$6:$W$195))","v":""}]
[null,null,null,"",{"$f":"IF('Output for PDFs'!L64=\"\",\"\",'Output for PDFs'!L64)","v":""},{"$f":"IF('Output for PDFs'!M64=0,\"\",'Output for PDFs'!M64)","v":""},{"$f":"'Output for PDFs'!E64","v":""},{"$f":"IF(D65=\"\",\"\",SUMIF(Input!$R$6:$R$195,D65,Input!$W$6:$W$195))","v":""}]
[null,"Signature________________________________________Title______________________________Date______________",null,null,null,null,null,null,null,null,null,"last line on page 1 long"]

{"sheet":"Age Rate Matrix","index":3,"n_rows":50,"n_cols":8,"rows_kept":50,"cut":false,"hidden":false,"merged":[[9,1,9,9],[38,1,38,9],[1,1,1,6],[2,1,2,6],[4,1,4,9],[5,1,5,9],[6,1,6,9],[7,1,7,9]]}
[null,{"$f":"Input!B1","v":" VERSION 1 2025"}]
[null,{"$f":"'Group Rate Summary'!B2:G2","v":""}]
[null,{"$f":"'Group Rate Summary'!B3:G3","v":"Effective "}]
[]
[null,{"$f":"Tables!B4&\" Age Matrix Summary\"","v":"WPS Age Matrix Summary"}]
[null,{"$f":"'Group Rate Summary'!B6","v":"PLAN - WPS 0  (HIOS ID: )                   COUNTY: "}]
[null,{"$f":"'Group Rate Summary'!B7","v":{"$error":"#N/A"}}]
[null,{"$f":"'Group Rate Summary'!B8","v":{"$error":"#N/A"}}]
[]
[null,"Monthly Premium Rates"]
[]
[null,null,null,"Age","Rate",null,"Age","Rate"]
[null,null,null,"< 15",{"$f":"Tables!BB5","v":{"$error":"#N/A"}},null,40,{"$f":"Tables!BB31","v":{"$error":"#N/A"}}]
[null,null,null,15,{"$f":"Tables!BB6","v":{"$error":"#N/A"}},null,41,{"$f":"Tables!BB32","v":{"$error":"#N/A"}}]
[null,null,null,16,{"$f":"Tables!BB7","v":{"$error":"#N/A"}},null,42,{"$f":"Tables!BB33","v":{"$error":"#N/A"}}]
[null,null,null,17,{"$f":"Tables!BB8","v":{"$error":"#N/A"}},null,43,{"$f":"Tables!BB34","v":{"$error":"#N/A"}}]
[null,null,null,18,{"$f":"Tables!BB9","v":{"$error":"#N/A"}},null,44,{"$f":"Tables!BB35","v":{"$error":"#N/A"}}]
[null,null,null,19,{"$f":"Tables!BB10","v":{"$error":"#N/A"}},null,45,{"$f":"Tables!BB36","v":{"$error":"#N/A"}}]
[null,null,null,20,{"$f":"Tables!BB11","v":{"$error":"#N/A"}},null,46,{"$f":"Tables!BB37","v":{"$error":"#N/A"}}]
[null,null,null,21,{"$f":"Tables!BB12","v":{"$error":"#N/A"}},null,47,{"$f":"Tables!BB38","v":{"$error":"#N/A"}}]
[null,null,null,22,{"$f":"Tables!BB13","v":{"$error":"#N/A"}},null,48,{"$f":"Tables!BB39","v":{"$error":"#N/A"}}]
[null,null,null,23,{"$f":"Tables!BB14","v":{"$error":"#N/A"}},null,49,{"$f":"Tables!BB40","v":{"$error":"#N/A"}}]
[null,null,null,24,{"$f":"Tables!BB15","v":{"$error":"#N/A"}},null,50,{"$f":"Tables!BB41","v":{"$error":"#N/A"}}]
[null,null,null,25,{"$f":"Tables!BB16","v":{"$error":"#N/A"}},null,51,{"$f":"Tables!BB42","v":{"$error":"#N/A"}}]
[null,null,null,26,{"$f":"Tables!BB17","v":{"$error":"#N/A"}},null,52,{"$f":"Tables!BB43","v":{"$error":"#N/A"}}]
[null,null,null,27,{"$f":"Tables!BB18","v":{"$error":"#N/A"}},null,53,{"$f":"Tables!BB44","v":{"$error":"#N/A"}}]
[null,null,null,28,{"$f":"Tables!BB19","v":{"$error":"#N/A"}},null,54,{"$f":"Tables!BB45","v":{"$error":"#N/A"}}]
[null,null,null,29,{"$f":"Tables!BB20","v":{"$error":"#N/A"}},null,55,{"$f":"Tables!BB46","v":{"$error":"#N/A"}}]
[null,null,null,30,{"$f":"Tables!BB21","v":{"$error":"#N/A"}},null,56,{"$f":"Tables!BB47","v":{"$error":"#N/A"}}]
[null,null,null,31,{"$f":"Tables!BB22","v":{"$error":"#N/A"}},null,57,{"$f":"Tables!BB48","v":{"$error":"#N/A"}}]
[null,null,null,32,{"$f":"Tables!BB23","v":{"$error":"#N/A"}},null,58,{"$f":"Tables!BB49","v":{"$error":"#N/A"}}]
[null,null,null,33,{"$f":"Tables!BB24","v":{"$error":"#N/A"}},null,59,{"$f":"Tables!BB50","v":{"$error":"#N/A"}}]
[null,null,null,34,{"$f":"Tables!BB25","v":{"$error":"#N/A"}},null,60,{"$f":"Tables!BB51","v":{"$error":"#N/A"}}]
[null,null,null,35,{"$f":"Tables!BB26","v":{"$error":"#N/A"}},null,61,{"$f":"Tables!BB52","v":{"$error":"#N/A"}}]
[null,null,null,36,{"$f":"Tables!BB27","v":{"$error":"#N/A"}},null,62,{"$f":"Tables!BB53","v":{"$error":"#N/A"}}]
[null,null,null,37,{"$f":"Tables!BB28","v":{"$error":"#N/A"}},null,63,{"$f":"Tables!BB54","v":{"$error":"#N/A"}}]
[null,null,null,38,{"$f":"Tables!BB29","v":{"$error":"#N/A"}},null,"64 +",{"$f":"Tables!BB55","v":{"$error":"#N/A"}}]
[null,null,null,39,{"$f":"Tables!BB30","v":{"$error":"#N/A"}}]
[null,"Age rate adjustments occur at the group renewal date."]
[]
[null,"Rate Calculation for Each Employee"]
[]
[null,null,null,"    Employee Age Rate"]
[null,null,"+","    Spouse Age Rate"]
[null,null,"+","    Up to Three Oldest Dependent(s) Under Age 21 Rate(s)"]
[null,null,"+","    Additional Adult Dependent(s) Age 21 and Older Rate(s)"]
[]
[]
[]
[null,"Signature________________________________________Title______________________________Date______________"]

{"sheet":"Alternates","index":4,"n_rows":57,"n_cols":41,"rows_kept":57,"cut":false,"hidden":false,"merged":[[1,1,1,9],[2,1,2,9],[3,1,3,9]]}
[null,{"$f":"Input!B1","v":" VERSION 1 2025"},null,null,null,null,null,null,null,null,null,null,null,null,null,null,"hide","hide","hide","hide","hide","hide","hide","hide","hide","hide","hide","hide","hide","hide","hide","hide","hide","hide","hide","hide","hide","hide","hide","hide","hide"]
[null,{"$f":"'Group Rate Summary'!B2:G2","v":""}]
[null,{"$f":"\"Small Group Alternates - \"&'Group Rate Summary'!B3:G3","v":"Small Group Alternates - Effective "},null,null,null,null,null,null,null,null,null,null,null,null,null,null,"IGNORE BLUE FONT DUE TO CONDITIONAL FORMATTING WHEN NO PLAN SELECTED!"]
[null,{"$f":"Input!E15&\" Network\"","v":" Network"}]
[null,null,null,null,null,null,null,null,null,null,null,null,null,null,null,null,"WPS Health Plan Alternates",null,null,null,null,null,null,null,null,null,null,null,null,"WPS Alternates"]
[null,null,null,null,"HDHP",null,null,"Retail",null,null,"Pre-","Drug Benefit",null,null,null,null,null,null,null,"HDHP",null,null,"Retail",null,null,"Pre-","Drug Benefit",null,null,null,null,null,"HDHP",null,null,"Retail",null,null,"Pre-","Drug Benefit"]
[null,null,null,null,"Deductible","ER","Teledoc","Clinic","PCP","Specialist","ventive","Generic Pref | Generic Non-Pref","Monthly",null,null,null,null,null,null,"Deductible","ER","Teledoc","Clinic","PCP","Specialist","ventive","Generic Pref | Generic Non-Pref","Monthly",null,null,null,null,"Deductible","ER","Teledoc","Clinic","PCP","Specialist","ventive","Generic Pref | Generic Non-Pref","Monthly"]
[null,"     Plan Name","HIOS ID","Plan Design","Type","Copay","Copay","Copay","Copay","Copay","Care","Brand Pref | Brand Non-Pref | Specialty","  Rate *",null,null,null,"Plan Name","HIOS ID","Plan Design","Type","Copay","Copay","Copay","Copay","Copay","Care","Brand Pref | Brand Non-Pref | Specialty","Rate",null,"Plan Name","HIOS ID","Plan Design","Type","Copay","Copay","Copay","Copay","Copay","Care","Brand Pref | Brand Non-Pref | Specialty","Rate"]
[]
[null,{"$f":"IF(AND(Tables!$B$4=\"WPS\",Tables!$C$15=\"First Health\"),AD31,IF(AND(Tables!$B$4=\"WPS Health Plan\",Tables!$C$15=\"First Health POS\"),Q52,IF(AND(Tables!$B$4=\"WPS\",Tables!$C$15=\"WPS Statewide\"),AD10,Q10)))","v":0},{"$f":"IF(AND(Tables!$B$4=\"WPS\",Tables!$C$15=\"First Health\"),AE31,IF(AND(Tables!$B$4=\"WPS Health Plan\",Tables!$C$15=\"First Health POS\"),R52,IF(Tables!$C$15=\"WPS Statewide\",AE10,R10)))","v":0},{"$f":"IF(AND(Tables!$B$4=\"WPS\",Tables!$C$15=\"First Health\"),AF31,IF(AND(Tables!$B$4=\"WPS Health Plan\",Tables!$C$15=\"First Health POS\"),S52,IF(Tables!$C$15=\"WPS Statewide\",AF10,S10)))","v":0},null,{"$f":"IF(AND(Tables!$B$4=\"WPS\",Tables!$C$15=\"First Health\"),AH31,IF(AND(Tables!$B$4=\"WPS Health Plan\",Tables!$C$15=\"First Health POS\"),U52,IF(Tables!$C$15=\"WPS Statewide\",AH10,U10)))","v":0},{"$f":"IF(AND(Tables!$B$4=\"WPS\",Tables!$C$15=\"First Health\"),AI31,IF(AND(Tables!$B$4=\"WPS Health Plan\",Tables!$C$15=\"First Health POS\"),V52,IF(Tables!$C$15=\"WPS Statewide\",AI10,V10)))","v":0},{"$f":"IF(AND(Tables!$B$4=\"WPS\",Tables!$C$15=\"First Health\"),AJ31,IF(AND(Tables!$B$4=\"WPS Health Plan\",Tables!$C$15=\"First Health POS\"),W52,IF(Tables!$C$15=\"WPS Statewide\",AJ10,W10)))","v":0},{"$f":"IF(AND(Tables!$B$4=\"WPS\",Tables!$C$15=\"First Health\"),AK31,IF(AND(Tables!$B$4=\"WPS Health Plan\",Tables!$C$15=\"First Health POS\"),X52,IF(Tables!$C$15=\"WPS Statewide\",AK10,X10)))","v":0},{"$f":"IF(AND(Tables!$B$4=\"WPS\",Tables!$C$15=\"First Health\"),AL31,IF(AND(Tables!$B$4=\"WPS Health Plan\",Tables!$C$15=\"First Health POS\"),Y52,IF(Tables!$C$15=\"WPS Statewide\",AL10,Y10)))","v":0},{"$f":"IF(AND(Tables!$B$4=\"WPS\",Tables!$C$15=\"First Health\"),AM31,IF(AND(Tables!$B$4=\"WPS Health Plan\",Tables!$C$15=\"First Health POS\"),Z52,IF(Tables!$C$15=\"WPS Statewide\",AM10,Z10)))","v":0},{"$f":"IF(AND(Tables!$B$4=\"WPS\",Tables!$C$15=\"First Health\"),AN31,IF(AND(Tables!$B$4=\"WPS Health Plan\",Tables!$C$15=\"First Health POS\"),AA52,IF(Tables!$C$15=\"WPS Statewide\",AN10,AA10)))","v":0},{"$f":"IF(AND(Tables!$B$4=\"WPS\",Tables!$C$15=\"First Health\"),AO31,IF(AND(Tables!$B$4=\"WPS Health Plan\",Tables!$C$15=\"First Health POS\"),AB52,IF(Tables!$C$15=\"WPS Statewide\",AO10,AB10)))","v":0},null,null,null,null,null,null,null,null,null,null,null,null,null,null,null,null,{"$f":"Tables!Y5","v":"WPS PPO Platinum $500"},{"$f":"Tables!Z5","v":"81974WI1930002"},{"$f":"DOLLAR(Tables!AD5,0)&\"/\"&DOLLAR(Tables!AM5,0)&\" Ded, \"&Tables!AE5&\"/\"&Tables!AN5&\" Coins, \"&DOLLAR(Tables!AF5,0)&\"/\"&DOLLAR(Tables!AO5,0)&\" OOP\"","v":"$500/$1,000 Ded, 20%/50% Coins, $1,700/$11,000 OOP"}," ",{"$f":"Tables!AL5","v":500},{"$f":"Tables!AG5","v":0},{"$f":"Tables!AH5","v":10},{"$f":"Tables!AI5","v":35},{"$f":"Tables!AJ5","v":70},0,{"$f":"Tables!AW5","v":"$10 / $25 / $50 / $90 / D/C"},{"$f":"IF(Tables!$B$4=\"WPS Health Plan\",0,ROUND('Rating Formula'!$C$7*Tables!AA5*'Rating Formula'!$C$10,2)*'Rating Formula'!$C$16)","v":{"$error":"#N/A"}}]
[null,{"$f":"IF(AND(Tables!$B$4=\"WPS\",Tables!$C$15=\"First Health\"),AD32,IF(AND(Tables!$B$4=\"WPS Health Plan\",Tables!$C$15=\"First Health POS\"),Q53,IF(AND(Tables!$B$4=\"WPS\",Tables!$C$15=\"WPS Statewide\"),AD11,Q11)))","v":0},{"$f":"IF(AND(Tables!$B$4=\"WPS\",Tables!$C$15=\"First Health\"),AE32,IF(AND(Tables!$B$4=\"WPS Health Plan\",Tables!$C$15=\"First Health POS\"),R53,IF(Tables!$C$15=\"WPS Statewide\",AE11,R11)))","v":0},{"$f":"IF(AND(Tables!$B$4=\"WPS\",Tables!$C$15=\"First Health\"),AF32,IF(AND(Tables!$B$4=\"WPS Health Plan\",Tables!$C$15=\"First Health POS\"),S53,IF(Tables!$C$15=\"WPS Statewide\",AF11,S11)))","v":0},null,{"$f":"IF(AND(Tables!$B$4=\"WPS\",Tables!$C$15=\"First Health\"),AH32,IF(AND(Tables!$B$4=\"WPS Health Plan\",Tables!$C$15=\"First Health POS\"),U53,IF(Tables!$C$15=\"WPS Statewide\",AH11,U11)))","v":0},{"$f":"IF(AND(Tables!$B$4=\"WPS\",Tables!$C$15=\"First Health\"),AI32,IF(AND(Tables!$B$4=\"WPS Health Plan\",Tables!$C$15=\"First Health POS\"),V53,IF(Tables!$C$15=\"WPS Statewide\",AI11,V11)))","v":0},{"$f":"IF(AND(Tables!$B$4=\"WPS\",Tables!$C$15=\"First Health\"),AJ32,IF(AND(Tables!$B$4=\"WPS Health Plan\",Tables!$C$15=\"First Health POS\"),W53,IF(Tables!$C$15=\"WPS Statewide\",AJ11,W11)))","v":0},{"$f":"IF(AND(Tables!$B$4=\"WPS\",Tables!$C$15=\"First Health\"),AK32,IF(AND(Tables!$B$4=\"WPS Health Plan\",Tables!$C$15=\"First Health POS\"),X53,IF(Tables!$C$15=\"WPS Statewide\",AK11,X11)))","v":0},{"$f":"IF(AND(Tables!$B$4=\"WPS\",Tables!$C$15=\"First Health\"),AL32,IF(AND(Tables!$B$4=\"WPS Health Plan\",Tables!$C$15=\"First Health POS\"),Y53,IF(Tables!$C$15=\"WPS Statewide\",AL11,Y11)))","v":0},{"$f":"IF(AND(Tables!$B$4=\"WPS\",Tables!$C$15=\"First Health\"),AM32,IF(AND(Tables!$B$4=\"WPS Health Plan\",Tables!$C$15=\"First Health POS\"),Z53,IF(Tables!$C$15=\"WPS Statewide\",AM11,Z11)))","v":0},{"$f":"IF(AND(Tables!$B$4=\"WPS\",Tables!$C$15=\"First Health\"),AN32,IF(AND(Tables!$B$4=\"WPS Health Plan\",Tables!$C$15=\"First Health POS\"),AA53,IF(Tables!$C$15=\"WPS Statewide\",AN11,AA11)))","v":0},{"$f":"IF(AND(Tables!$B$4=\"WPS\",Tables!$C$15=\"First Health\"),AO32,IF(AND(Tables!$B$4=\"WPS Health Plan\",Tables!$C$15=\"First Health POS\"),AB53,IF(Tables!$C$15=\"WPS Statewide\",AO11,AB11)))","v":0},null,null,null,null,null,null,null,null,null,null,null,null,null,null,null,null,{"$f":"Tables!Y6","v":"WPS PPO Gold $1,000"},{"$f":"Tables!Z6","v":"81974WI1930009"},{"$f":"DOLLAR(Tables!AD6,0)&\"/\"&DOLLAR(Tables!AM6,0)&\" Ded, \"&Tables!AE6&\"/\"&Tables!AN6&\" Coins, \"&DOLLAR(Tables!AF6,0)&\"/\"&DOLLAR(Tables!AO6,0)&\" OOP\"","v":"$1,000/$2,000 Ded, 20%/50% Coins, $7,350/$12,000 OOP"}," ",{"$f":"Tables!AL6","v":500},{"$f":"Tables!AG6","v":0},{"$f":"Tables!AH6","v":10},{"$f":"Tables!AI6","v":35},{"$f":"Tables!AJ6","v":70},0,{"$f":"Tables!AW6","v":"$10 / $25 / $50 / $90 / D/C"},{"$f":"IF(Tables!$B$4=\"WPS Health Plan\",0,ROUND('Rating Formula'!$C$7*Tables!AA6*'Rating Formula'!$C$10,2)*'Rating Formula'!$C$16)","v":{"$error":"#N/A"}}]
[null,{"$f":"IF(AND(Tables!$B$4=\"WPS\",Tables!$C$15=\"First Health\"),AD33,IF(AND(Tables!$B$4=\"WPS Health Plan\",Tables!$C$15=\"First Health POS\"),Q54,IF(AND(Tables!$B$4=\"WPS\",Tables!$C$15=\"WPS Statewide\"),AD12,Q12)))","v":0},{"$f":"IF(AND(Tables!$B$4=\"WPS\",Tables!$C$15=\"First Health\"),AE33,IF(AND(Tables!$B$4=\"WPS Health Plan\",Tables!$C$15=\"First Health POS\"),R54,IF(Tables!$C$15=\"WPS Statewide\",AE12,R12)))","v":0},{"$f":"IF(AND(Tables!$B$4=\"WPS\",Tables!$C$15=\"First Health\"),AF33,IF(AND(Tables!$B$4=\"WPS Health Plan\",Tables!$C$15=\"First Health POS\"),S54,IF(Tables!$C$15=\"WPS Statewide\",AF12,S12)))","v":0},null,{"$f":"IF(AND(Tables!$B$4=\"WPS\",Tables!$C$15=\"First Health\"),AH33,IF(AND(Tables!$B$4=\"WPS Health Plan\",Tables!$C$15=\"First Health POS\"),U54,IF(Tables!$C$15=\"WPS Statewide\",AH12,U12)))","v":0},{"$f":"IF(AND(Tables!$B$4=\"WPS\",Tables!$C$15=\"First Health\"),AI33,IF(AND(Tables!$B$4=\"WPS Health Plan\",Tables!$C$15=\"First Health POS\"),V54,IF(Tables!$C$15=\"WPS Statewide\",AI12,V12)))","v":0},{"$f":"IF(AND(Tables!$B$4=\"WPS\",Tables!$C$15=\"First Health\"),AJ33,IF(AND(Tables!$B$4=\"WPS Health Plan\",Tables!$C$15=\"First Health POS\"),W54,IF(Tables!$C$15=\"WPS Statewide\",AJ12,W12)))","v":0},{"$f":"IF(AND(Tables!$B$4=\"WPS\",Tables!$C$15=\"First Health\"),AK33,IF(AND(Tables!$B$4=\"WPS Health Plan\",Tables!$C$15=\"First Health POS\"),X54,IF(Tables!$C$15=\"WPS Statewide\",AK12,X12)))","v":0},{"$f":"IF(AND(Tables!$B$4=\"WPS\",Tables!$C$15=\"First Health\"),AL33,IF(AND(Tables!$B$4=\"WPS Health Plan\",Tables!$C$15=\"First Health POS\"),Y54,IF(Tables!$C$15=\"WPS Statewide\",AL12,Y12)))","v":0},{"$f":"IF(AND(Tables!$B$4=\"WPS\",Tables!$C$15=\"First Health\"),AM33,IF(AND(Tables!$B$4=\"WPS Health Plan\",Tables!$C$15=\"First Health POS\"),Z54,IF(Tables!$C$15=\"WPS Statewide\",AM12,Z12)))","v":0},{"$f":"IF(AND(Tables!$B$4=\"WPS\",Tables!$C$15=\"First Health\"),AN33,IF(AND(Tables!$B$4=\"WPS Health Plan\",Tables!$C$15=\"First Health POS\"),AA54,IF(Tables!$C$15=\"WPS Statewide\",AN12,AA12)))","v":0},{"$f":"IF(AND(Tables!$B$4=\"WPS\",Tables!$C$15=\"First Health\"),AO33,IF(AND(Tables!$B$4=\"WPS Health Plan\",Tables!$C$15=\"First Health POS\"),AB54,IF(Tables!$C$15=\"WPS Statewide\",AO12,AB12)))","v":0},null,null,null,null,null,null,null,null,null,null,null,null,null,null,null,null,{"$f":"Tables!Y7","v":"WPS PPO Gold $1,500"},{"$f":"Tables!Z7","v":"81974WI1930040"},{"$f":"DOLLAR(Tables!AD7,0)&\"/\"&DOLLAR(Tables!AM7,0)&\" Ded, \"&Tables!AE7&\"/\"&Tables!AN7&\" Coins, \"&DOLLAR(Tables!AF7,0)&\"/\"&DOLLAR(Tables!AO7,0)&\" OOP\"","v":"$1,500/$3,000 Ded, 10%/50% Coins, $6,750/$13,000 OOP"}," ",{"$f":"Tables!AL7","v":500},{"$f":"Tables!AG7","v":0},{"$f":"Tables!AH7","v":10},{"$f":"Tables!AI7","v":35},{"$f":"Tables!AJ7","v":70},0,{"$f":"Tables!AW7","v":"$10 / $25 / $50 / $90 / D/C"},{"$f":"IF(Tables!$B$4=\"WPS Health Plan\",0,ROUND('Rating Formula'!$C$7*Tables!AA7*'Rating Formula'!$C$10,2)*'Rating Formula'!$C$16)","v":{"$error":"#N/A"}}]
[null,{"$f":"IF(AND(Tables!$B$4=\"WPS\",Tables!$C$15=\"First Health\"),AD34,IF(AND(Tables!$B$4=\"WPS Health Plan\",Tables!$C$15=\"First Health POS\"),Q55,IF(AND(Tables!$B$4=\"WPS\",Tables!$C$15=\"WPS Statewide\"),AD13,Q13)))","v":0},{"$f":"IF(AND(Tables!$B$4=\"WPS\",Tables!$C$15=\"First Health\"),AE34,IF(AND(Tables!$B$4=\"WPS Health Plan\",Tables!$C$15=\"First Health POS\"),R55,IF(Tables!$C$15=\"WPS Statewide\",AE13,R13)))","v":0},{"$f":"IF(AND(Tables!$B$4=\"WPS\",Tables!$C$15=\"First Health\"),AF34,IF(AND(Tables!$B$4=\"WPS Health Plan\",Tables!$C$15=\"First Health POS\"),S55,IF(Tables!$C$15=\"WPS Statewide\",AF13,S13)))","v":0},null,{"$f":"IF(AND(Tables!$B$4=\"WPS\",Tables!$C$15=\"First Health\"),AH34,IF(AND(Tables!$B$4=\"WPS Health Plan\",Tables!$C$15=\"First Health POS\"),U55,IF(Tables!$C$15=\"WPS Statewide\",AH13,U13)))","v":0},{"$f":"IF(AND(Tables!$B$4=\"WPS\",Tables!$C$15=\"First Health\"),AI34,IF(AND(Tables!$B$4=\"WPS Health Plan\",Tables!$C$15=\"First Health POS\"),V55,IF(Tables!$C$15=\"WPS Statewide\",AI13,V13)))","v":0},{"$f":"IF(AND(Tables!$B$4=\"WPS\",Tables!$C$15=\"First Health\"),AJ34,IF(AND(Tables!$B$4=\"WPS Health Plan\",Tables!$C$15=\"First Health POS\"),W55,IF(Tables!$C$15=\"WPS Statewide\",AJ13,W13)))","v":0},{"$f":"IF(AND(Tables!$B$4=\"WPS\",Tables!$C$15=\"First Health\"),AK34,IF(AND(Tables!$B$4=\"WPS Health Plan\",Tables!$C$15=\"First Health POS\"),X55,IF(Tables!$C$15=\"WPS Statewide\",AK13,X13)))","v":0},{"$f":"IF(AND(Tables!$B$4=\"WPS\",Tables!$C$15=\"First Health\"),AL34,IF(AND(Tables!$B$4=\"WPS Health Plan\",Tables!$C$15=\"First Health POS\"),Y55,IF(Tables!$C$15=\"WPS Statewide\",AL13,Y13)))","v":0},{"$f":"IF(AND(Tables!$B$4=\"WPS\",Tables!$C$15=\"First Health\"),AM34,IF(AND(Tables!$B$4=\"WPS Health Plan\",Tables!$C$15=\"First Health POS\"),Z55,IF(Tables!$C$15=\"WPS Statewide\",AM13,Z13)))","v":0},{"$f":"IF(AND(Tables!$B$4=\"WPS\",Tables!$C$15=\"First Health\"),AN34,IF(AND(Tables!$B$4=\"WPS Health Plan\",Tables!$C$15=\"First Health POS\"),AA55,IF(Tables!$C$15=\"WPS Statewide\",AN13,AA13)))","v":0},{"$f":"IF(AND(Tables!$B$4=\"WPS\",Tables!$C$15=\"First Health\"),AO34,IF(AND(Tables!$B$4=\"WPS Health Plan\",Tables!$C$15=\"First Health POS\"),AB55,IF(Tables!$C$15=\"WPS Statewide\",AO13,AB13)))","v":0},null,null,null,null,null,null,null,null,null,null,null,null,null,null,null,null,{"$f":"Tables!Y8","v":"WPS PPO Gold $2,000"},{"$f":"Tables!Z8","v":"81974WI1930041"},{"$f":"DOLLAR(Tables!AD8,0)&\"/\"&DOLLAR(Tables!AM8,0)&\" Ded, \"&Tables!AE8&\"/\"&Tables!AN8&\" Coins, \"&DOLLAR(Tables!AF8,0)&\"/\"&DOLLAR(Tables!AO8,0)&\" OOP\"","v":"$2,000/$4,000 Ded, 20%/50% Coins, $5,950/$14,000 OOP"}," ",{"$f":"Tables!AL8","v":500},{"$f":"Tables!AG8","v":0},{"$f":"Tables!AH8","v":10},{"$f":"Tables!AI8","v":35},{"$f":"Tables!AJ8","v":70},0,{"$f":"Tables!AW8","v":"$10 / $25 / $50 / $90 / D/C"},{"$f":"IF(Tables!$B$4=\"WPS Health Plan\",0,ROUND('Rating Formula'!$C$7*Tables!AA8*'Rating Formula'!$C$10,2)*'Rating Formula'!$C$16)","v":{"$error":"#N/A"}}]
[null,{"$f":"IF(AND(Tables!$B$4=\"WPS\",Tables!$C$15=\"First Health\"),AD35,IF(AND(Tables!$B$4=\"WPS Health Plan\",Tables!$C$15=\"First Health POS\"),Q56,IF(AND(Tables!$B$4=\"WPS\",Tables!$C$15=\"WPS Statewide\"),AD14,Q14)))","v":0},{"$f":"IF(AND(Tables!$B$4=\"WPS\",Tables!$C$15=\"First Health\"),AE35,IF(AND(Tables!$B$4=\"WPS Health Plan\",Tables!$C$15=\"First Health POS\"),R56,IF(Tables!$C$15=\"WPS Statewide\",AE14,R14)))","v":0},{"$f":"IF(AND(Tables!$B$4=\"WPS\",Tables!$C$15=\"First Health\"),AF35,IF(AND(Tables!$B$4=\"WPS Health Plan\",Tables!$C$15=\"First Health POS\"),S56,IF(Tables!$C$15=\"WPS Statewide\",AF14,S14)))","v":0},null,{"$f":"IF(AND(Tables!$B$4=\"WPS\",Tables!$C$15=\"First Health\"),AH35,IF(AND(Tables!$B$4=\"WPS Health Plan\",Tables!$C$15=\"First Health POS\"),U56,IF(Tables!$C$15=\"WPS Statewide\",AH14,U14)))","v":0},{"$f":"IF(AND(Tables!$B$4=\"WPS\",Tables!$C$15=\"First Health\"),AI35,IF(AND(Tables!$B$4=\"WPS Health Plan\",Tables!$C$15=\"First Health POS\"),V56,IF(Tables!$C$15=\"WPS Statewide\",AI14,V14)))","v":0},{"$f":"IF(AND(Tables!$B$4=\"WPS\",Tables!$C$15=\"First Health\"),AJ35,IF(AND(Tables!$B$4=\"WPS Health Plan\",Tables!$C$15=\"First Health POS\"),W56,IF(Tables!$C$15=\"WPS Statewide\",AJ14,W14)))","v":0},{"$f":"IF(AND(Tables!$B$4=\"WPS\",Tables!$C$15=\"First Health\"),AK35,IF(AND(Tables!$B$4=\"WPS Health Plan\",Tables!$C$15=\"First Health POS\"),X56,IF(Tables!$C$15=\"WPS Statewide\",AK14,X14)))","v":0},{"$f":"IF(AND(Tables!$B$4=\"WPS\",Tables!$C$15=\"First Health\"),AL35,IF(AND(Tables!$B$4=\"WPS Health Plan\",Tables!$C$15=\"First Health POS\"),Y56,IF(Tables!$C$15=\"WPS Statewide\",AL14,Y14)))","v":0},{"$f":"IF(AND(Tables!$B$4=\"WPS\",Tables!$C$15=\"First Health\"),AM35,IF(AND(Tables!$B$4=\"WPS Health Plan\",Tables!$C$15=\"First Health POS\"),Z56,IF(Tables!$C$15=\"WPS Statewide\",AM14,Z14)))","v":0},{"$f":"IF(AND(Tables!$B$4=\"WPS\",Tables!$C$15=\"First Health\"),AN35,IF(AND(Tables!$B$4=\"WPS Health Plan\",Tables!$C$15=\"First Health POS\"),AA56,IF(Tables!$C$15=\"WPS Statewide\",AN14,AA14)))","v":0},{"$f":"IF(AND(Tables!$B$4=\"WPS\",Tables!$C$15=\"First Health\"),AO35,IF(AND(Tables!$B$4=\"WPS Health Plan\",Tables!$C$15=\"First Health POS\"),AB56,IF(Tables!$C$15=\"WPS Statewide\",AO14,AB14)))","v":0},null,null,null,null,null,null,null,null,null,null,null,null,null,null,null,null,{"$f":"Tables!Y9","v":"WPS PPO Gold $2,500"},{"$f":"Tables!Z9","v":"81974WI1930042"},{"$f":"DOLLAR(Tables!AD9,0)&\"/\"&DOLLAR(Tables!AM9,0)&\" Ded, \"&Tables!AE9&\"/\"&Tables!AN9&\" Coins, \"&DOLLAR(Tables!AF9,0)&\"/\"&DOLLAR(Tables!AO9,0)&\" OOP\"","v":"$2,500/$5,000 Ded, 20%/50% Coins, $5,800/$15,000 OOP"}," ",{"$f":"Tables!AL9","v":500},{"$f":"Tables!AG9","v":0},{"$f":"Tables!AH9","v":10},{"$f":"Tables!AI9","v":35},{"$f":"Tables!AJ9","v":70},0,{"$f":"Tables!AW9","v":"$10 / $25 / $50 / $90 / D/C"},{"$f":"IF(Tables!$B$4=\"WPS Health Plan\",0,ROUND('Rating Formula'!$C$7*Tables!AA9*'Rating Formula'!$C$10,2)*'Rating Formula'!$C$16)","v":{"$error":"#N/A"}}]
[null,{"$f":"IF(AND(Tables!$B$4=\"WPS\",Tables!$C$15=\"First Health\"),AD36,IF(AND(Tables!$B$4=\"WPS Health Plan\",Tables!$C$15=\"First Health POS\"),Q57,IF(AND(Tables!$B$4=\"WPS\",Tables!$C$15=\"WPS Statewide\"),AD15,Q15)))","v":0},{"$f":"IF(AND(Tables!$B$4=\"WPS\",Tables!$C$15=\"First Health\"),AE36,IF(AND(Tables!$B$4=\"WPS Health Plan\",Tables!$C$15=\"First Health POS\"),R57,IF(Tables!$C$15=\"WPS Statewide\",AE15,R15)))","v":0},{"$f":"IF(AND(Tables!$B$4=\"WPS\",Tables!$C$15=\"First Health\"),AF36,IF(AND(Tables!$B$4=\"WPS Health Plan\",Tables!$C$15=\"First Health POS\"),S57,IF(Tables!$C$15=\"WPS Statewide\",AF15,S15)))","v":0},null,{"$f":"IF(AND(Tables!$B$4=\"WPS\",Tables!$C$15=\"First Health\"),AH36,IF(AND(Tables!$B$4=\"WPS Health Plan\",Tables!$C$15=\"First Health POS\"),U57,IF(Tables!$C$15=\"WPS Statewide\",AH15,U15)))","v":0},{"$f":"IF(AND(Tables!$B$4=\"WPS\",Tables!$C$15=\"First Health\"),AI36,IF(AND(Tables!$B$4=\"WPS Health Plan\",Tables!$C$15=\"First Health POS\"),V57,IF(Tables!$C$15=\"WPS Statewide\",AI15,V15)))","v":0},{"$f":"IF(AND(Tables!$B$4=\"WPS\",Tables!$C$15=\"First Health\"),AJ36,IF(AND(Tables!$B$4=\"WPS Health Plan\",Tables!$C$15=\"First Health POS\"),W57,IF(Tables!$C$15=\"WPS Statewide\",AJ15,W15)))","v":0},{"$f":"IF(AND(Tables!$B$4=\"WPS\",Tables!$C$15=\"First Health\"),AK36,IF(AND(Tables!$B$4=\"WPS Health Plan\",Tables!$C$15=\"First Health POS\"),X57,IF(Tables!$C$15=\"WPS Statewide\",AK15,X15)))","v":0},{"$f":"IF(AND(Tables!$B$4=\"WPS\",Tables!$C$15=\"First Health\"),AL36,IF(AND(Tables!$B$4=\"WPS Health Plan\",Tables!$C$15=\"First Health POS\"),Y57,IF(Tables!$C$15=\"WPS Statewide\",AL15,Y15)))","v":0},{"$f":"IF(AND(Tables!$B$4=\"WPS\",Tables!$C$15=\"First Health\"),AM36,IF(AND(Tables!$B$4=\"WPS Health Plan\",Tables!$C$15=\"First Health POS\"),Z57,IF(Tables!$C$15=\"WPS Statewide\",AM15,Z15)))","v":0},{"$f":"IF(AND(Tables!$B$4=\"WPS\",Tables!$C$15=\"First Health\"),AN36,IF(AND(Tables!$B$4=\"WPS Health Plan\",Tables!$C$15=\"First Health POS\"),AA57,IF(Tables!$C$15=\"WPS Statewide\",AN15,AA15)))","v":0},{"$f":"IF(AND(Tables!$B$4=\"WPS\",Tables!$C$15=\"First Health\"),AO36,IF(AND(Tables!$B$4=\"WPS Health Plan\",Tables!$C$15=\"First Health POS\"),AB57,IF(Tables!$C$15=\"WPS Statewide\",AO15,AB15)))","v":0},null,null,null,null,null,null,null,null,null,null,null,null,null,null,null,null,{"$f":"Tables!Y10","v":"WPS PPO Silver $5,000"},{"$f":"Tables!Z10","v":"81974WI1930033"},{"$f":"DOLLAR(Tables!AD10,0)&\"/\"&DOLLAR(Tables!AM10,0)&\" Ded, \"&Tables!AE10&\"/\"&Tables!AN10&\" Coins, \"&DOLLAR(Tables!AF10,0)&\"/\"&DOLLAR(Tables!AO10,0)&\" OOP\"","v":"$5,000/$10,000 Ded, 25%/50% Coins, $9,200/$20,000 OOP"}," ",{"$f":"Tables!AL10","v":750},{"$f":"Tables!AG10","v":0},{"$f":"Tables!AH10","v":10},{"$f":"Tables!AI10","v":50},{"$f":"Tables!AJ10","v":100},0,{"$f":"Tables!AW10","v":"$20 / $40 / $80 / $125 / D/C"},{"$f":"IF(Tables!$B$4=\"WPS Health Plan\",0,ROUND('Rating Formula'!$C$7*Tables!AA10*'Rating Formula'!$C$10,2)*'Rating Formula'!$C$16)","v":{"$error":"#N/A"}}]
[null,{"$f":"IF(AND(Tables!$B$4=\"WPS\",Tables!$C$15=\"First Health\"),AD37,IF(AND(Tables!$B$4=\"WPS Health Plan\",Tables!$C$15=\"First Health POS\"),Q58,IF(AND(Tables!$B$4=\"WPS\",Tables!$C$15=\"WPS Statewide\"),AD16,Q16)))","v":0},{"$f":"IF(AND(Tables!$B$4=\"WPS\",Tables!$C$15=\"First Health\"),AE37,IF(AND(Tables!$B$4=\"WPS Health Plan\",Tables!$C$15=\"First Health POS\"),R58,IF(Tables!$C$15=\"WPS Statewide\",AE16,R16)))","v":0},{"$f":"IF(AND(Tables!$B$4=\"WPS\",Tables!$C$15=\"First Health\"),AF37,IF(AND(Tables!$B$4=\"WPS Health Plan\",Tables!$C$15=\"First Health POS\"),S58,IF(Tables!$C$15=\"WPS Statewide\",AF16,S16)))","v":0},null,{"$f":"IF(AND(Tables!$B$4=\"WPS\",Tables!$C$15=\"First Health\"),AH37,IF(AND(Tables!$B$4=\"WPS Health Plan\",Tables!$C$15=\"First Health POS\"),U58,IF(Tables!$C$15=\"WPS Statewide\",AH16,U16)))","v":0},{"$f":"IF(AND(Tables!$B$4=\"WPS\",Tables!$C$15=\"First Health\"),AI37,IF(AND(Tables!$B$4=\"WPS Health Plan\",Tables!$C$15=\"First Health POS\"),V58,IF(Tables!$C$15=\"WPS Statewide\",AI16,V16)))","v":0},{"$f":"IF(AND(Tables!$B$4=\"WPS\",Tables!$C$15=\"First Health\"),AJ37,IF(AND(Tables!$B$4=\"WPS Health Plan\",Tables!$C$15=\"First Health POS\"),W58,IF(Tables!$C$15=\"WPS Statewide\",AJ16,W16)))","v":0},{"$f":"IF(AND(Tables!$B$4=\"WPS\",Tables!$C$15=\"First Health\"),AK37,IF(AND(Tables!$B$4=\"WPS Health Plan\",Tables!$C$15=\"First Health POS\"),X58,IF(Tables!$C$15=\"WPS Statewide\",AK16,X16)))","v":0},{"$f":"IF(AND(Tables!$B$4=\"WPS\",Tables!$C$15=\"First Health\"),AL37,IF(AND(Tables!$B$4=\"WPS Health Plan\",Tables!$C$15=\"First Health POS\"),Y58,IF(Tables!$C$15=\"WPS Statewide\",AL16,Y16)))","v":0},{"$f":"IF(AND(Tables!$B$4=\"WPS\",Tables!$C$15=\"First Health\"),AM37,IF(AND(Tables!$B$4=\"WPS Health Plan\",Tables!$C$15=\"First Health POS\"),Z58,IF(Tables!$C$15=\"WPS Statewide\",AM16,Z16)))","v":0},{"$f":"IF(AND(Tables!$B$4=\"WPS\",Tables!$C$15=\"First Health\"),AN37,IF(AND(Tables!$B$4=\"WPS Health Plan\",Tables!$C$15=\"First Health POS\"),AA58,IF(Tables!$C$15=\"WPS Statewide\",AN16,AA16)))","v":0},{"$f":"IF(AND(Tables!$B$4=\"WPS\",Tables!$C$15=\"First Health\"),AO37,IF(AND(Tables!$B$4=\"WPS Health Plan\",Tables!$C$15=\"First Health POS\"),AB58,IF(Tables!$C$15=\"WPS Statewide\",AO16,AB16)))","v":0},null,null,null,null,null,null,null,null,null,null,null,null,null,null,null,null,{"$f":"Tables!Y11","v":"WPS PPO Silver $5,500"},{"$f":"Tables!Z11","v":"81974WI1930047"},{"$f":"DOLLAR(Tables!AD11,0)&\"/\"&DOLLAR(Tables!AM11,0)&\" Ded, \"&Tables!AE11&\"/\"&Tables!AN11&\" Coins, \"&DOLLAR(Tables!AF11,0)&\"/\"&DOLLAR(Tables!AO11,0)&\" OOP\"","v":"$5,500/$11,000 Ded, 25%/50% Coins, $9,200/$21,000 OOP"}," ",{"$f":"Tables!AL11","v":750},{"$f":"Tables!AG11","v":0},{"$f":"Tables!AH11","v":10},{"$f":"Tables!AI11","v":50},{"$f":"Tables!AJ11","v":100},0,{"$f":"Tables!AW11","v":"$20 / $40 / $80 / $125 / D/C"},{"$f":"IF(Tables!$B$4=\"WPS Health Plan\",0,ROUND('Rating Formula'!$C$7*Tables!AA11*'Rating Formula'!$C$10,2)*'Rating Formula'!$C$16)","v":{"$error":"#N/A"}}]
[null,{"$f":"IF(AND(Tables!$B$4=\"WPS\",Tables!$C$15=\"First Health\"),AD38,IF(AND(Tables!$B$4=\"WPS Health Plan\",Tables!$C$15=\"First Health POS\"),Q59,IF(AND(Tables!$B$4=\"WPS\",Tables!$C$15=\"WPS Statewide\"),AD17,Q17)))","v":0},{"$f":"IF(AND(Tables!$B$4=\"WPS\",Tables!$C$15=\"First Health\"),AE38,IF(AND(Tables!$B$4=\"WPS Health Plan\",Tables!$C$15=\"First Health POS\"),R59,IF(Tables!$C$15=\"WPS Statewide\",AE17,R17)))","v":0},{"$f":"IF(AND(Tables!$B$4=\"WPS\",Tables!$C$15=\"First Health\"),AF38,IF(AND(Tables!$B$4=\"WPS Health Plan\",Tables!$C$15=\"First Health POS\"),S59,IF(Tables!$C$15=\"WPS Statewide\",AF17,S17)))","v":0},null,{"$f":"IF(AND(Tables!$B$4=\"WPS\",Tables!$C$15=\"First Health\"),AH38,IF(AND(Tables!$B$4=\"WPS Health Plan\",Tables!$C$15=\"First Health POS\"),U59,IF(Tables!$C$15=\"WPS Statewide\",AH17,U17)))","v":0},{"$f":"IF(AND(Tables!$B$4=\"WPS\",Tables!$C$15=\"First Health\"),AI38,IF(AND(Tables!$B$4=\"WPS Health Plan\",Tables!$C$15=\"First Health POS\"),V59,IF(Tables!$C$15=\"WPS Statewide\",AI17,V17)))","v":0},{"$f":"IF(AND(Tables!$B$4=\"WPS\",Tables!$C$15=\"First Health\"),AJ38,IF(AND(Tables!$B$4=\"WPS Health Plan\",Tables!$C$15=\"First Health POS\"),W59,IF(Tables!$C$15=\"WPS Statewide\",AJ17,W17)))","v":0},{"$f":"IF(AND(Tables!$B$4=\"WPS\",Tables!$C$15=\"First Health\"),AK38,IF(AND(Tables!$B$4=\"WPS Health Plan\",Tables!$C$15=\"First Health POS\"),X59,IF(Tables!$C$15=\"WPS Statewide\",AK17,X17)))","v":0},{"$f":"IF(AND(Tables!$B$4=\"WPS\",Tables!$C$15=\"First Health\"),AL38,IF(AND(Tables!$B$4=\"WPS Health Plan\",Tables!$C$15=\"First Health POS\"),Y59,IF(Tables!$C$15=\"WPS Statewide\",AL17,Y17)))","v":0},{"$f":"IF(AND(Tables!$B$4=\"WPS\",Tables!$C$15=\"First Health\"),AM38,IF(AND(Tables!$B$4=\"WPS Health Plan\",Tables!$C$15=\"First Health POS\"),Z59,IF(Tables!$C$15=\"WPS Statewide\",AM17,Z17)))","v":0},{"$f":"IF(AND(Tables!$B$4=\"WPS\",Tables!$C$15=\"First Health\"),AN38,IF(AND(Tables!$B$4=\"WPS Health Plan\",Tables!$C$15=\"First Health POS\"),AA59,IF(Tables!$C$15=\"WPS Statewide\",AN17,AA17)))","v":0},{"$f":"IF(AND(Tables!$B$4=\"WPS\",Tables!$C$15=\"First Health\"),AO38,IF(AND(Tables!$B$4=\"WPS Health Plan\",Tables!$C$15=\"First Health POS\"),AB59,IF(Tables!$C$15=\"WPS Statewide\",AO17,AB17)))","v":0},null,null,null,null,null,null,null,null,null,null,null,null,null,null,null,null,{"$f":"Tables!Y12","v":"WPS PPO Silver $5,700"},{"$f":"Tables!Z12","v":"81974WI1930032"},{"$f":"DOLLAR(Tables!AD12,0)&\"/\"&DOLLAR(Tables!AM12,0)&\" Ded, \"&Tables!AE12&\"/\"&Tables!AN12&\" Coins, \"&DOLLAR(Tables!AF12,0)&\"/\"&DOLLAR(Tables!AO12,0)&\" OOP\"","v":"$5,700/$11,400 Ded, 15%/50% Coins, $9,200/$21,400 OOP"}," ",{"$f":"Tables!AL12","v":750},{"$f":"Tables!AG12","v":0},{"$f":"Tables!AH12","v":10},{"$f":"Tables!AI12","v":50},{"$f":"Tables!AJ12","v":100},0,{"$f":"Tables!AW12","v":"$20 / $40 / $80 / $125 / D/C"},{"$f":"IF(Tables!$B$4=\"WPS Health Plan\",0,ROUND('Rating Formula'!$C$7*Tables!AA12*'Rating Formula'!$C$10,2)*'Rating Formula'!$C$16)","v":{"$error":"#N/A"}}]
[null,{"$f":"IF(AND(Tables!$B$4=\"WPS\",Tables!$C$15=\"First Health\"),AD39,IF(AND(Tables!$B$4=\"WPS Health Plan\",Tables!$C$15=\"First Health POS\"),Q60,IF(AND(Tables!$B$4=\"WPS\",Tables!$C$15=\"WPS Statewide\"),AD18,Q18)))","v":0},{"$f":"IF(AND(Tables!$B$4=\"WPS\",Tables!$C$15=\"First Health\"),AE39,IF(AND(Tables!$B$4=\"WPS Health Plan\",Tables!$C$15=\"First Health POS\"),R60,IF(Tables!$C$15=\"WPS Statewide\",AE18,R18)))","v":0},{"$f":"IF(AND(Tables!$B$4=\"WPS\",Tables!$C$15=\"First Health\"),AF39,IF(AND(Tables!$B$4=\"WPS Health Plan\",Tables!$C$15=\"First Health POS\"),S60,IF(Tables!$C$15=\"WPS Statewide\",AF18,S18)))","v":0},null,{"$f":"IF(AND(Tables!$B$4=\"WPS\",Tables!$C$15=\"First Health\"),AH39,IF(AND(Tables!$B$4=\"WPS Health Plan\",Tables!$C$15=\"First Health POS\"),U60,IF(Tables!$C$15=\"WPS Statewide\",AH18,U18)))","v":0},{"$f":"IF(AND(Tables!$B$4=\"WPS\",Tables!$C$15=\"First Health\"),AI39,IF(AND(Tables!$B$4=\"WPS Health Plan\",Tables!$C$15=\"First Health POS\"),V60,IF(Tables!$C$15=\"WPS Statewide\",AI18,V18)))","v":0},{"$f":"IF(AND(Tables!$B$4=\"WPS\",Tables!$C$15=\"First Health\"),AJ39,IF(AND(Tables!$B$4=\"WPS Health Plan\",Tables!$C$15=\"First Health POS\"),W60,IF(Tables!$C$15=\"WPS Statewide\",AJ18,W18)))","v":0},{"$f":"IF(AND(Tables!$B$4=\"WPS\",Tables!$C$15=\"First Health\"),AK39,IF(AND(Tables!$B$4=\"WPS Health Plan\",Tables!$C$15=\"First Health POS\"),X60,IF(Tables!$C$15=\"WPS Statewide\",AK18,X18)))","v":0},{"$f":"IF(AND(Tables!$B$4=\"WPS\",Tables!$C$15=\"First Health\"),AL39,IF(AND(Tables!$B$4=\"WPS Health Plan\",Tables!$C$15=\"First Health POS\"),Y60,IF(Tables!$C$15=\"WPS Statewide\",AL18,Y18)))","v":0},{"$f":"IF(AND(Tables!$B$4=\"WPS\",Tables!$C$15=\"First Health\"),AM39,IF(AND(Tables!$B$4=\"WPS Health Plan\",Tables!$C$15=\"First Health POS\"),Z60,IF(Tables!$C$15=\"WPS Statewide\",AM18,Z18)))","v":0},{"$f":"IF(AND(Tables!$B$4=\"WPS\",Tables!$C$15=\"First Health\"),AN39,IF(AND(Tables!$B$4=\"WPS Health Plan\",Tables!$C$15=\"First Health POS\"),AA60,IF(Tables!$C$15=\"WPS Statewide\",AN18,AA18)))","v":0},{"$f":"IF(AND(Tables!$B$4=\"WPS\",Tables!$C$15=\"First Health\"),AO39,IF(AND(Tables!$B$4=\"WPS Health Plan\",Tables!$C$15=\"First Health POS\"),AB60,IF(Tables!$C$15=\"WPS Statewide\",AO18,AB18)))","v":0},null,null,null,null,null,null,null,null,null,null,null,null,null,null,null,null,{"$f":"Tables!Y13","v":"WPS PPO Silver $6,000"},{"$f":"Tables!Z13","v":"81974WI1930044"},{"$f":"DOLLAR(Tables!AD13,0)&\"/\"&DOLLAR(Tables!AM13,0)&\" Ded, \"&Tables!AE13&\"/\"&Tables!AN13&\" Coins, \"&DOLLAR(Tables!AF13,0)&\"/\"&DOLLAR(Tables!AO13,0)&\" OOP\"","v":"$6,000/$12,000 Ded, 25%/50% Coins, $9,000/$22,000 OOP"}," ",{"$f":"Tables!AL13","v":750},{"$f":"Tables!AG13","v":0},{"$f":"Tables!AH13","v":10},{"$f":"Tables!AI13","v":50},{"$f":"Tables!AJ13","v":100},0,{"$f":"Tables!AW13","v":"$20 / $40 / $80 / $125 / D/C"},{"$f":"IF(Tables!$B$4=\"WPS Health Plan\",0,ROUND('Rating Formula'!$C$7*Tables!AA13*'Rating Formula'!$C$10,2)*'Rating Formula'!$C$16)","v":{"$error":"#N/A"}}]
[null,{"$f":"IF(AND(Tables!$B$4=\"WPS\",Tables!$C$15=\"First Health\"),AD40,IF(AND(Tables!$B$4=\"WPS Health Plan\",Tables!$C$15=\"First Health POS\"),Q61,IF(AND(Tables!$B$4=\"WPS\",Tables!$C$15=\"WPS Statewide\"),AD19,Q19)))","v":0},{"$f":"IF(AND(Tables!$B$4=\"WPS\",Tables!$C$15=\"First Health\"),AE40,IF(AND(Tables!$B$4=\"WPS Health Plan\",Tables!$C$15=\"First Health POS\"),R61,IF(Tables!$C$15=\"WPS Statewide\",AE19,R19)))","v":0},{"$f":"IF(AND(Tables!$B$4=\"WPS\",Tables!$C$15=\"First Health\"),AF40,IF(AND(Tables!$B$4=\"WPS Health Plan\",Tables!$C$15=\"First Health POS\"),S61,IF(Tables!$C$15=\"WPS Statewide\",AF19,S19)))","v":0},null,{"$f":"IF(AND(Tables!$B$4=\"WPS\",Tables!$C$15=\"First Health\"),AH40,IF(AND(Tables!$B$4=\"WPS Health Plan\",Tables!$C$15=\"First Health POS\"),U61,IF(Tables!$C$15=\"WPS Statewide\",AH19,U19)))","v":0},{"$f":"IF(AND(Tables!$B$4=\"WPS\",Tables!$C$15=\"First Health\"),AI40,IF(AND(Tables!$B$4=\"WPS Health Plan\",Tables!$C$15=\"First Health POS\"),V61,IF(Tables!$C$15=\"WPS Statewide\",AI19,V19)))","v":0},{"$f":"IF(AND(Tables!$B$4=\"WPS\",Tables!$C$15=\"First Health\"),AJ40,IF(AND(Tables!$B$4=\"WPS Health Plan\",Tables!$C$15=\"First Health POS\"),W61,IF(Tables!$C$15=\"WPS Statewide\",AJ19,W19)))","v":0},{"$f":"IF(AND(Tables!$B$4=\"WPS\",Tables!$C$15=\"First Health\"),AK40,IF(AND(Tables!$B$4=\"WPS Health Plan\",Tables!$C$15=\"First Health POS\"),X61,IF(Tables!$C$15=\"WPS Statewide\",AK19,X19)))","v":0},{"$f":"IF(AND(Tables!$B$4=\"WPS\",Tables!$C$15=\"First Health\"),AL40,IF(AND(Tables!$B$4=\"WPS Health Plan\",Tables!$C$15=\"First Health POS\"),Y61,IF(Tables!$C$15=\"WPS Statewide\",AL19,Y19)))","v":0},{"$f":"IF(AND(Tables!$B$4=\"WPS\",Tables!$C$15=\"First Health\"),AM40,IF(AND(Tables!$B$4=\"WPS Health Plan\",Tables!$C$15=\"First Health POS\"),Z61,IF(Tables!$C$15=\"WPS Statewide\",AM19,Z19)))","v":0},{"$f":"IF(AND(Tables!$B$4=\"WPS\",Tables!$C$15=\"First Health\"),AN40,IF(AND(Tables!$B$4=\"WPS Health Plan\",Tables!$C$15=\"First Health POS\"),AA61,IF(Tables!$C$15=\"WPS Statewide\",AN19,AA19)))","v":0},{"$f":"IF(AND(Tables!$B$4=\"WPS\",Tables!$C$15=\"First Health\"),AO40,IF(AND(Tables!$B$4=\"WPS Health Plan\",Tables!$C$15=\"First Health POS\"),AB61,IF(Tables!$C$15=\"WPS Statewide\",AO19,AB19)))","v":0},null,null,null,null,null,null,null,null,null,null,null,null,null,null,null,null,{"$f":"Tables!Y14","v":"WPS PPO Silver $6,500"},{"$f":"Tables!Z14","v":"81974WI1930048"},{"$f":"DOLLAR(Tables!AD14,0)&\"/\"&DOLLAR(Tables!AM14,0)&\" Ded, \"&Tables!AE14&\"/\"&Tables!AN14&\" Coins, \"&DOLLAR(Tables!AF14,0)&\"/\"&DOLLAR(Tables!AO14,0)&\" OOP\"","v":"$6,500/$13,000 Ded, 35%/50% Coins, $9,200/$23,000 OOP"}," ",{"$f":"Tables!AL14","v":750},{"$f":"Tables!AG14","v":0},{"$f":"Tables!AH14","v":10},{"$f":"Tables!AI14","v":50},{"$f":"Tables!AJ14","v":100},0,{"$f":"Tables!AW14","v":"$20 / $40 / $80 / $125 / D/C"},{"$f":"IF(Tables!$B$4=\"WPS Health Plan\",0,ROUND('Rating Formula'!$C$7*Tables!AA14*'Rating Formula'!$C$10,2)*'Rating Formula'!$C$16)","v":{"$error":"#N/A"}}]
[null,{"$f":"IF(AND(Tables!$B$4=\"WPS\",Tables!$C$15=\"First Health\"),AD41,IF(AND(Tables!$B$4=\"WPS Health Plan\",Tables!$C$15=\"First Health POS\"),Q62,IF(AND(Tables!$B$4=\"WPS\",Tables!$C$15=\"WPS Statewide\"),AD20,Q20)))","v":0},{"$f":"IF(AND(Tables!$B$4=\"WPS\",Tables!$C$15=\"First Health\"),AE41,IF(AND(Tables!$B$4=\"WPS Health Plan\",Tables!$C$15=\"First Health POS\"),R62,IF(Tables!$C$15=\"WPS Statewide\",AE20,R20)))","v":0},{"$f":"IF(AND(Tables!$B$4=\"WPS\",Tables!$C$15=\"First Health\"),AF41,IF(AND(Tables!$B$4=\"WPS Health Plan\",Tables!$C$15=\"First Health POS\"),S62,IF(Tables!$C$15=\"WPS Statewide\",AF20,S20)))","v":0},null,{"$f":"IF(AND(Tables!$B$4=\"WPS\",Tables!$C$15=\"First Health\"),AH41,IF(AND(Tables!$B$4=\"WPS Health Plan\",Tables!$C$15=\"First Health POS\"),U62,IF(Tables!$C$15=\"WPS Statewide\",AH20,U20)))","v":0},{"$f":"IF(AND(Tables!$B$4=\"WPS\",Tables!$C$15=\"First Health\"),AI41,IF(AND(Tables!$B$4=\"WPS Health Plan\",Tables!$C$15=\"First Health POS\"),V62,IF(Tables!$C$15=\"WPS Statewide\",AI20,V20)))","v":0},{"$f":"IF(AND(Tables!$B$4=\"WPS\",Tables!$C$15=\"First Health\"),AJ41,IF(AND(Tables!$B$4=\"WPS Health Plan\",Tables!$C$15=\"First Health POS\"),W62,IF(Tables!$C$15=\"WPS Statewide\",AJ20,W20)))","v":0},{"$f":"IF(AND(Tables!$B$4=\"WPS\",Tables!$C$15=\"First Health\"),AK41,IF(AND(Tables!$B$4=\"WPS Health Plan\",Tables!$C$15=\"First Health POS\"),X62,IF(Tables!$C$15=\"WPS Statewide\",AK20,X20)))","v":0},{"$f":"IF(AND(Tables!$B$4=\"WPS\",Tables!$C$15=\"First Health\"),AL41,IF(AND(Tables!$B$4=\"WPS Health Plan\",Tables!$C$15=\"First Health POS\"),Y62,IF(Tables!$C$15=\"WPS Statewide\",AL20,Y20)))","v":0},{"$f":"IF(AND(Tables!$B$4=\"WPS\",Tables!$C$15=\"First Health\"),AM41,IF(AND(Tables!$B$4=\"WPS Health Plan\",Tables!$C$15=\"First Health POS\"),Z62,IF(Tables!$C$15=\"WPS Statewide\",AM20,Z20)))","v":0},{"$f":"IF(AND(Tables!$B$4=\"WPS\",Tables!$C$15=\"First Health\"),AN41,IF(AND(Tables!$B$4=\"WPS Health Plan\",Tables!$C$15=\"First Health POS\"),AA62,IF(Tables!$C$15=\"WPS Statewide\",AN20,AA20)))","v":0},{"$f":"IF(AND(Tables!$B$4=\"WPS\",Tables!$C$15=\"First Health\"),AO41,IF(AND(Tables!$B$4=\"WPS Health Plan\",Tables!$C$15=\"First Health POS\"),AB62,IF(Tables!$C$15=\"WPS Statewide\",AO20,AB20)))","v":0},null,null,null,null,null,null,null,null,null,null,null,null,null,null,null,null,{"$f":"Tables!Y15","v":"WPS PPO Silver $9,000"},{"$f":"Tables!Z15","v":"81974WI1930046"},{"$f":"DOLLAR(Tables!AD15,0)&\"/\"&DOLLAR(Tables!AM15,0)&\" Ded, \"&Tables!AE15&\"/\"&Tables!AN15&\" Coins, \"&DOLLAR(Tables!AF15,0)&\"/\"&DOLLAR(Tables!AO15,0)&\" OOP\"","v":"$9,000/$18,000 Ded, 0%/30% Coins, $9,000/$24,000 OOP"}," ",{"$f":"Tables!AL15","v":750},{"$f":"Tables!AG15","v":0},{"$f":"Tables!AH15","v":10},{"$f":"Tables!AI15","v":50},{"$f":"Tables!AJ15","v":100},0,{"$f":"Tables!AW15","v":"$20 / $40 / $80 / $125 / D/C"},{"$f":"IF(Tables!$B$4=\"WPS Health Plan\",0,ROUND('Rating Formula'!$C$7*Tables!AA15*'Rating Formula'!$C$10,2)*'Rating Formula'!$C$16)","v":{"$error":"#N/A"}}]
[null,{"$f":"IF(AND(Tables!$B$4=\"WPS\",Tables!$C$15=\"First Health\"),AD42,IF(AND(Tables!$B$4=\"WPS Health Plan\",Tables!$C$15=\"First Health POS\"),Q63,IF(AND(Tables!$B$4=\"WPS\",Tables!$C$15=\"WPS Statewide\"),AD21,Q21)))","v":0},{"$f":"IF(AND(Tables!$B$4=\"WPS\",Tables!$C$15=\"First Health\"),AE42,IF(AND(Tables!$B$4=\"WPS Health Plan\",Tables!$C$15=\"First Health POS\"),R63,IF(Tables!$C$15=\"WPS Statewide\",AE21,R21)))","v":0},{"$f":"IF(AND(Tables!$B$4=\"WPS\",Tables!$C$15=\"First Health\"),AF42,IF(AND(Tables!$B$4=\"WPS Health Plan\",Tables!$C$15=\"First Health POS\"),S63,IF(Tables!$C$15=\"WPS Statewide\",AF21,S21)))","v":0},{"$f":"IF(AND(Tables!$B$4=\"WPS\",Tables!$C$15=\"First Health\"),AG42,IF(AND(Tables!$B$4=\"WPS Health Plan\",Tables!$C$15=\"First Health POS\"),T63,IF(Tables!$C$15=\"WPS Statewide\",AG21,T21)))","v":0},{"$f":"IF(AND(Tables!$B$4=\"WPS\",Tables!$C$15=\"First Health\"),AH42,IF(AND(Tables!$B$4=\"WPS Health Plan\",Tables!$C$15=\"First Health POS\"),U63,IF(Tables!$C$15=\"WPS Statewide\",AH21,U21)))","v":0},{"$f":"IF(AND(Tables!$B$4=\"WPS\",Tables!$C$15=\"First Health\"),AI42,IF(AND(Tables!$B$4=\"WPS Health Plan\",Tables!$C$15=\"First Health POS\"),V63,IF(Tables!$C$15=\"WPS Statewide\",AI21,V21)))","v":0},{"$f":"IF(AND(Tables!$B$4=\"WPS\",Tables!$C$15=\"First Health\"),AJ42,IF(AND(Tables!$B$4=\"WPS Health Plan\",Tables!$C$15=\"First Health POS\"),W63,IF(Tables!$C$15=\"WPS Statewide\",AJ21,W21)))","v":0},{"$f":"IF(AND(Tables!$B$4=\"WPS\",Tables!$C$15=\"First Health\"),AK42,IF(AND(Tables!$B$4=\"WPS Health Plan\",Tables!$C$15=\"First Health POS\"),X63,IF(Tables!$C$15=\"WPS Statewide\",AK21,X21)))","v":0},{"$f":"IF(AND(Tables!$B$4=\"WPS\",Tables!$C$15=\"First Health\"),AL42,IF(AND(Tables!$B$4=\"WPS Health Plan\",Tables!$C$15=\"First Health POS\"),Y63,IF(Tables!$C$15=\"WPS Statewide\",AL21,Y21)))","v":0},{"$f":"IF(AND(Tables!$B$4=\"WPS\",Tables!$C$15=\"First Health\"),AM42,IF(AND(Tables!$B$4=\"WPS Health Plan\",Tables!$C$15=\"First Health POS\"),Z63,IF(Tables!$C$15=\"WPS Statewide\",AM21,Z21)))","v":0},{"$f":"IF(AND(Tables!$B$4=\"WPS\",Tables!$C$15=\"First Health\"),AN42,IF(AND(Tables!$B$4=\"WPS Health Plan\",Tables!$C$15=\"First Health POS\"),AA63,IF(Tables!$C$15=\"WPS Statewide\",AN21,AA21)))","v":0},{"$f":"IF(AND(Tables!$B$4=\"WPS\",Tables!$C$15=\"First Health\"),AO42,IF(AND(Tables!$B$4=\"WPS Health Plan\",Tables!$C$15=\"First Health POS\"),AB63,IF(Tables!$C$15=\"WPS Statewide\",AO21,AB21)))","v":0},null,null,null,null,null,null,null,null,null,null,null,null,null,null,null,null,{"$f":"Tables!Y16","v":"WPS PPO HDHP Gold $3,000"},{"$f":"Tables!Z16","v":"81974WI1930022"},{"$f":"DOLLAR(Tables!AD16,0)&\"/\"&DOLLAR(Tables!AM16,0)&\" Ded, \"&Tables!AE16&\"/\"&Tables!AN16&\" Coins, \"&DOLLAR(Tables!AF16,0)&\"/\"&DOLLAR(Tables!AO16,0)&\" OOP\"","v":"$3,000/$6,000 Ded, 0%/30% Coins, $3,000/$12,000 OOP"},"Non-Emb",{"$f":"Tables!AL16","v":"D/C"},{"$f":"Tables!AG16","v":"D/C"},{"$f":"Tables!AH16","v":"D/C"},{"$f":"Tables!AI16","v":"D/C"},{"$f":"Tables!AJ16","v":"D/C"},0,{"$f":"Tables!AW16","v":"Plan Deductible, then Coinsurance"},{"$f":"IF(Tables!$B$4=\"WPS Health Plan\",0,ROUND('Rating Formula'!$C$7*Tables!AA16*'Rating Formula'!$C$10,2)*'Rating Formula'!$C$16)","v":{"$error":"#N/A"}}]
[null,{"$f":"IF(AND(Tables!$B$4=\"WPS\",Tables!$C$15=\"First Health\"),AD43,IF(AND(Tables!$B$4=\"WPS Health Plan\",Tables!$C$15=\"First Health POS\"),Q64,IF(AND(Tables!$B$4=\"WPS\",Tables!$C$15=\"WPS Statewide\"),AD22,Q22)))","v":0},{"$f":"IF(AND(Tables!$B$4=\"WPS\",Tables!$C$15=\"First Health\"),AE43,IF(AND(Tables!$B$4=\"WPS Health Plan\",Tables!$C$15=\"First Health POS\"),R64,IF(Tables!$C$15=\"WPS Statewide\",AE22,R22)))","v":0},{"$f":"IF(AND(Tables!$B$4=\"WPS\",Tables!$C$15=\"First Health\"),AF43,IF(AND(Tables!$B$4=\"WPS Health Plan\",Tables!$C$15=\"First Health POS\"),S64,IF(Tables!$C$15=\"WPS Statewide\",AF22,S22)))","v":0},{"$f":"IF(AND(Tables!$B$4=\"WPS\",Tables!$C$15=\"First Health\"),AG43,IF(AND(Tables!$B$4=\"WPS Health Plan\",Tables!$C$15=\"First Health POS\"),T64,IF(Tables!$C$15=\"WPS Statewide\",AG22,T22)))","v":0},{"$f":"IF(AND(Tables!$B$4=\"WPS\",Tables!$C$15=\"First Health\"),AH43,IF(AND(Tables!$B$4=\"WPS Health Plan\",Tables!$C$15=\"First Health POS\"),U64,IF(Tables!$C$15=\"WPS Statewide\",AH22,U22)))","v":0},{"$f":"IF(AND(Tables!$B$4=\"WPS\",Tables!$C$15=\"First Health\"),AI43,IF(AND(Tables!$B$4=\"WPS Health Plan\",Tables!$C$15=\"First Health POS\"),V64,IF(Tables!$C$15=\"WPS Statewide\",AI22,V22)))","v":0},{"$f":"IF(AND(Tables!$B$4=\"WPS\",Tables!$C$15=\"First Health\"),AJ43,IF(AND(Tables!$B$4=\"WPS Health Plan\",Tables!$C$15=\"First Health POS\"),W64,IF(Tables!$C$15=\"WPS Statewide\",AJ22,W22)))","v":0},{"$f":"IF(AND(Tables!$B$4=\"WPS\",Tables!$C$15=\"First Health\"),AK43,IF(AND(Tables!$B$4=\"WPS Health Plan\",Tables!$C$15=\"First Health POS\"),X64,IF(Tables!$C$15=\"WPS Statewide\",AK22,X22)))","v":0},{"$f":"IF(AND(Tables!$B$4=\"WPS\",Tables!$C$15=\"First Health\"),AL43,IF(AND(Tables!$B$4=\"WPS Health Plan\",Tables!$C$15=\"First Health POS\"),Y64,IF(Tables!$C$15=\"WPS Statewide\",AL22,Y22)))","v":0},{"$f":"IF(AND(Tables!$B$4=\"WPS\",Tables!$C$15=\"First Health\"),AM43,IF(AND(Tables!$B$4=\"WPS Health Plan\",Tables!$C$15=\"First Health POS\"),Z64,IF(Tables!$C$15=\"WPS Statewide\",AM22,Z22)))","v":0},{"$f":"IF(AND(Tables!$B$4=\"WPS\",Tables!$C$15=\"First Health\"),AN43,IF(AND(Tables!$B$4=\"WPS Health Plan\",Tables!$C$15=\"First Health POS\"),AA64,IF(Tables!$C$15=\"WPS Statewide\",AN22,AA22)))","v":0},{"$f":"IF(AND(Tables!$B$4=\"WPS\",Tables!$C$15=\"First Health\"),AO43,IF(AND(Tables!$B$4=\"WPS Health Plan\",Tables!$C$15=\"First Health POS\"),AB64,IF(Tables!$C$15=\"WPS Statewide\",AO22,AB22)))","v":0},null,null,null,null,null,null,null,null,null,null,null,null,null,null,null,null,{"$f":"Tables!Y17","v":"WPS PPO HDHP Gold $3,750"},{"$f":"Tables!Z17","v":"81974WI1930049"},{"$f":"DOLLAR(Tables!AD17,0)&\"/\"&DOLLAR(Tables!AM17,0)&\" Ded, \"&Tables!AE17&\"/\"&Tables!AN17&\" Coins, \"&DOLLAR(Tables!AF17,0)&\"/\"&DOLLAR(Tables!AO17,0)&\" OOP\"","v":"$3,750/$7,500 Ded, 0%/30% Coins, $3,750/$13,500 OOP"},"Embedded",{"$f":"Tables!AL17","v":"D/C"},{"$f":"Tables!AG17","v":"D/C"},{"$f":"Tables!AH17","v":"D/C"},{"$f":"Tables!AI17","v":"D/C"},{"$f":"Tables!AJ17","v":"D/C"},0,{"$f":"Tables!AW17","v":"Plan Deductible, then Coinsurance"},{"$f":"IF(Tables!$B$4=\"WPS Health Plan\",0,ROUND('Rating Formula'!$C$7*Tables!AA17*'Rating Formula'!$C$10,2)*'Rating Formula'!$C$16)","v":{"$error":"#N/A"}}]
[null,{"$f":"IF(AND(Tables!$B$4=\"WPS\",Tables!$C$15=\"First Health\"),AD44,IF(AND(Tables!$B$4=\"WPS Health Plan\",Tables!$C$15=\"First Health POS\"),Q65,IF(AND(Tables!$B$4=\"WPS\",Tables!$C$15=\"WPS Statewide\"),AD23,Q23)))","v":0},{"$f":"IF(AND(Tables!$B$4=\"WPS\",Tables!$C$15=\"First Health\"),AE44,IF(AND(Tables!$B$4=\"WPS Health Plan\",Tables!$C$15=\"First Health POS\"),R65,IF(Tables!$C$15=\"WPS Statewide\",AE23,R23)))","v":0},{"$f":"IF(AND(Tables!$B$4=\"WPS\",Tables!$C$15=\"First Health\"),AF44,IF(AND(Tables!$B$4=\"WPS Health Plan\",Tables!$C$15=\"First Health POS\"),S65,IF(Tables!$C$15=\"WPS Statewide\",AF23,S23)))","v":0},{"$f":"IF(AND(Tables!$B$4=\"WPS\",Tables!$C$15=\"First Health\"),AG44,IF(AND(Tables!$B$4=\"WPS Health Plan\",Tables!$C$15=\"First Health POS\"),T65,IF(Tables!$C$15=\"WPS Statewide\",AG23,T23)))","v":0},{"$f":"IF(AND(Tables!$B$4=\"WPS\",Tables!$C$15=\"First Health\"),AH44,IF(AND(Tables!$B$4=\"WPS Health Plan\",Tables!$C$15=\"First Health POS\"),U65,IF(Tables!$C$15=\"WPS Statewide\",AH23,U23)))","v":0},{"$f":"IF(AND(Tables!$B$4=\"WPS\",Tables!$C$15=\"First Health\"),AI44,IF(AND(Tables!$B$4=\"WPS Health Plan\",Tables!$C$15=\"First Health POS\"),V65,IF(Tables!$C$15=\"WPS Statewide\",AI23,V23)))","v":0},{"$f":"IF(AND(Tables!$B$4=\"WPS\",Tables!$C$15=\"First Health\"),AJ44,IF(AND(Tables!$B$4=\"WPS Health Plan\",Tables!$C$15=\"First Health POS\"),W65,IF(Tables!$C$15=\"WPS Statewide\",AJ23,W23)))","v":0},{"$f":"IF(AND(Tables!$B$4=\"WPS\",Tables!$C$15=\"First Health\"),AK44,IF(AND(Tables!$B$4=\"WPS Health Plan\",Tables!$C$15=\"First Health POS\"),X65,IF(Tables!$C$15=\"WPS Statewide\",AK23,X23)))","v":0},{"$f":"IF(AND(Tables!$B$4=\"WPS\",Tables!$C$15=\"First Health\"),AL44,IF(AND(Tables!$B$4=\"WPS Health Plan\",Tables!$C$15=\"First Health POS\"),Y65,IF(Tables!$C$15=\"WPS Statewide\",AL23,Y23)))","v":0},{"$f":"IF(AND(Tables!$B$4=\"WPS\",Tables!$C$15=\"First Health\"),AM44,IF(AND(Tables!$B$4=\"WPS Health Plan\",Tables!$C$15=\"First Health POS\"),Z65,IF(Tables!$C$15=\"WPS Statewide\",AM23,Z23)))","v":0},{"$f":"IF(AND(Tables!$B$4=\"WPS\",Tables!$C$15=\"First Health\"),AN44,IF(AND(Tables!$B$4=\"WPS Health Plan\",Tables!$C$15=\"First Health POS\"),AA65,IF(Tables!$C$15=\"WPS Statewide\",AN23,AA23)))","v":0},{"$f":"IF(AND(Tables!$B$4=\"WPS\",Tables!$C$15=\"First Health\"),AO44,IF(AND(Tables!$B$4=\"WPS Health Plan\",Tables!$C$15=\"First Health POS\"),AB65,IF(Tables!$C$15=\"WPS Statewide\",AO23,AB23)))","v":0},null,null,null,null,null,null,null,null,null,null,null,null,null,null,null,null,{"$f":"Tables!Y18","v":"WPS PPO HDHP Silver $2,500"},{"$f":"Tables!Z18","v":"81974WI1930023"},{"$f":"DOLLAR(Tables!AD18,0)&\"/\"&DOLLAR(Tables!AM18,0)&\" Ded, \"&Tables!AE18&\"/\"&Tables!AN18&\" Coins, \"&DOLLAR(Tables!AF18,0)&\"/\"&DOLLAR(Tables!AO18,0)&\" OOP\"","v":"$2,500/$5,000 Ded, 30%/50% Coins, $8,000/$15,000 OOP"},"Non-Emb",{"$f":"Tables!AL18","v":"D/C"},{"$f":"Tables!AG18","v":"D/C"},{"$f":"Tables!AH18","v":"D/C"},{"$f":"Tables!AI18","v":"D/C"},{"$f":"Tables!AJ18","v":"D/C"},0,{"$f":"Tables!AW18","v":"Plan Deductible, then Coinsurance"},{"$f":"IF(Tables!$B$4=\"WPS Health Plan\",0,ROUND('Rating Formula'!$C$7*Tables!AA18*'Rating Formula'!$C$10,2)*'Rating Formula'!$C$16)","v":{"$error":"#N/A"}}]
[null,{"$f":"IF(AND(Tables!$B$4=\"WPS\",Tables!$C$15=\"First Health\"),AD45,IF(AND(Tables!$B$4=\"WPS Health Plan\",Tables!$C$15=\"First Health POS\"),Q66,IF(AND(Tables!$B$4=\"WPS\",Tables!$C$15=\"WPS Statewide\"),AD24,Q24)))","v":0},{"$f":"IF(AND(Tables!$B$4=\"WPS\",Tables!$C$15=\"First Health\"),AE45,IF(AND(Tables!$B$4=\"WPS Health Plan\",Tables!$C$15=\"First Health POS\"),R66,IF(Tables!$C$15=\"WPS Statewide\",AE24,R24)))","v":0},{"$f":"IF(AND(Tables!$B$4=\"WPS\",Tables!$C$15=\"First Health\"),AF45,IF(AND(Tables!$B$4=\"WPS Health Plan\",Tables!$C$15=\"First Health POS\"),S66,IF(Tables!$C$15=\"WPS Statewide\",AF24,S24)))","v":0},{"$f":"IF(AND(Tables!$B$4=\"WPS\",Tables!$C$15=\"First Health\"),AG45,IF(AND(Tables!$B$4=\"WPS Health Plan\",Tables!$C$15=\"First Health POS\"),T66,IF(Tables!$C$15=\"WPS Statewide\",AG24,T24)))","v":0},{"$f":"IF(AND(Tables!$B$4=\"WPS\",Tables!$C$15=\"First Health\"),AH45,IF(AND(Tables!$B$4=\"WPS Health Plan\",Tables!$C$15=\"First Health POS\"),U66,IF(Tables!$C$15=\"WPS Statewide\",AH24,U24)))","v":0},{"$f":"IF(AND(Tables!$B$4=\"WPS\",Tables!$C$15=\"First Health\"),AI45,IF(AND(Tables!$B$4=\"WPS Health Plan\",Tables!$C$15=\"First Health POS\"),V66,IF(Tables!$C$15=\"WPS Statewide\",AI24,V24)))","v":0},{"$f":"IF(AND(Tables!$B$4=\"WPS\",Tables!$C$15=\"First Health\"),AJ45,IF(AND(Tables!$B$4=\"WPS Health Plan\",Tables!$C$15=\"First Health POS\"),W66,IF(Tables!$C$15=\"WPS Statewide\",AJ24,W24)))","v":0},{"$f":"IF(AND(Tables!$B$4=\"WPS\",Tables!$C$15=\"First Health\"),AK45,IF(AND(Tables!$B$4=\"WPS Health Plan\",Tables!$C$15=\"First Health POS\"),X66,IF(Tables!$C$15=\"WPS Statewide\",AK24,X24)))","v":0},{"$f":"IF(AND(Tables!$B$4=\"WPS\",Tables!$C$15=\"First Health\"),AL45,IF(AND(Tables!$B$4=\"WPS Health Plan\",Tables!$C$15=\"First Health POS\"),Y66,IF(Tables!$C$15=\"WPS Statewide\",AL24,Y24)))","v":0},{"$f":"IF(AND(Tables!$B$4=\"WPS\",Tables!$C$15=\"First Health\"),AM45,IF(AND(Tables!$B$4=\"WPS Health Plan\",Tables!$C$15=\"First Health POS\"),Z66,IF(Tables!$C$15=\"WPS Statewide\",AM24,Z24)))","v":0},{"$f":"IF(AND(Tables!$B$4=\"WPS\",Tables!$C$15=\"First Health\"),AN45,IF(AND(Tables!$B$4=\"WPS Health Plan\",Tables!$C$15=\"First Health POS\"),AA66,IF(Tables!$C$15=\"WPS Statewide\",AN24,AA24)))","v":0},{"$f":"IF(AND(Tables!$B$4=\"WPS\",Tables!$C$15=\"First Health\"),AO45,IF(AND(Tables!$B$4=\"WPS Health Plan\",Tables!$C$15=\"First Health POS\"),AB66,IF(Tables!$C$15=\"WPS Statewide\",AO24,AB24)))","v":0},null,null,null,null,null,null,null,null,null,null,null,null,null,null,null,null,{"$f":"Tables!Y19","v":"WPS PPO HDHP Silver $3,300"},{"$f":"Tables!Z19","v":"81974WI1930035"},{"$f":"DOLLAR(Tables!AD19,0)&\"/\"&DOLLAR(Tables!AM19,0)&\" Ded, \"&Tables!AE19&\"/\"&Tables!AN19&\" Coins, \"&DOLLAR(Tables!AF19,0)&\"/\"&DOLLAR(Tables!AO19,0)&\" OOP\"","v":"$3,300/$6,600 Ded, 20%/50% Coins, $8,300/$16,600 OOP"},"Embedded",{"$f":"Tables!AL19","v":"D/C"},{"$f":"Tables!AG19","v":"D/C"},{"$f":"Tables!AH19","v":"D/C"},{"$f":"Tables!AI19","v":"D/C"},{"$f":"Tables!AJ19","v":"D/C"},0,{"$f":"Tables!AW19","v":"Plan Deductible, then Coinsurance"},{"$f":"IF(Tables!$B$4=\"WPS Health Plan\",0,ROUND('Rating Formula'!$C$7*Tables!AA19*'Rating Formula'!$C$10,2)*'Rating Formula'!$C$16)","v":{"$error":"#N/A"}}]
[null,{"$f":"IF(AND(Tables!$B$4=\"WPS\",Tables!$C$15=\"First Health\"),AD46,IF(AND(Tables!$B$4=\"WPS Health Plan\",Tables!$C$15=\"First Health POS\"),Q67,IF(AND(Tables!$B$4=\"WPS\",Tables!$C$15=\"WPS Statewide\"),AD25,Q25)))","v":0},{"$f":"IF(AND(Tables!$B$4=\"WPS\",Tables!$C$15=\"First Health\"),AE46,IF(AND(Tables!$B$4=\"WPS Health Plan\",Tables!$C$15=\"First Health POS\"),R67,IF(Tables!$C$15=\"WPS Statewide\",AE25,R25)))","v":0},{"$f":"IF(AND(Tables!$B$4=\"WPS\",Tables!$C$15=\"First Health\"),AF46,IF(AND(Tables!$B$4=\"WPS Health Plan\",Tables!$C$15=\"First Health POS\"),S67,IF(Tables!$C$15=\"WPS Statewide\",AF25,S25)))","v":0},{"$f":"IF(AND(Tables!$B$4=\"WPS\",Tables!$C$15=\"First Health\"),AG46,IF(AND(Tables!$B$4=\"WPS Health Plan\",Tables!$C$15=\"First Health POS\"),T67,IF(Tables!$C$15=\"WPS Statewide\",AG25,T25)))","v":0},{"$f":"IF(AND(Tables!$B$4=\"WPS\",Tables!$C$15=\"First Health\"),AH46,IF(AND(Tables!$B$4=\"WPS Health Plan\",Tables!$C$15=\"First Health POS\"),U67,IF(Tables!$C$15=\"WPS Statewide\",AH25,U25)))","v":0},{"$f":"IF(AND(Tables!$B$4=\"WPS\",Tables!$C$15=\"First Health\"),AI46,IF(AND(Tables!$B$4=\"WPS Health Plan\",Tables!$C$15=\"First Health POS\"),V67,IF(Tables!$C$15=\"WPS Statewide\",AI25,V25)))","v":0},{"$f":"IF(AND(Tables!$B$4=\"WPS\",Tables!$C$15=\"First Health\"),AJ46,IF(AND(Tables!$B$4=\"WPS Health Plan\",Tables!$C$15=\"First Health POS\"),W67,IF(Tables!$C$15=\"WPS Statewide\",AJ25,W25)))","v":0},{"$f":"IF(AND(Tables!$B$4=\"WPS\",Tables!$C$15=\"First Health\"),AK46,IF(AND(Tables!$B$4=\"WPS Health Plan\",Tables!$C$15=\"First Health POS\"),X67,IF(Tables!$C$15=\"WPS Statewide\",AK25,X25)))","v":0},{"$f":"IF(AND(Tables!$B$4=\"WPS\",Tables!$C$15=\"First Health\"),AL46,IF(AND(Tables!$B$4=\"WPS Health Plan\",Tables!$C$15=\"First Health POS\"),Y67,IF(Tables!$C$15=\"WPS Statewide\",AL25,Y25)))","v":0},{"$f":"IF(AND(Tables!$B$4=\"WPS\",Tables!$C$15=\"First Health\"),AM46,IF(AND(Tables!$B$4=\"WPS Health Plan\",Tables!$C$15=\"First Health POS\"),Z67,IF(Tables!$C$15=\"WPS Statewide\",AM25,Z25)))","v":0},{"$f":"IF(AND(Tables!$B$4=\"WPS\",Tables!$C$15=\"First Health\"),AN46,IF(AND(Tables!$B$4=\"WPS Health Plan\",Tables!$C$15=\"First Health POS\"),AA67,IF(Tables!$C$15=\"WPS Statewide\",AN25,AA25)))","v":0},{"$f":"IF(AND(Tables!$B$4=\"WPS\",Tables!$C$15=\"First Health\"),AO46,IF(AND(Tables!$B$4=\"WPS Health Plan\",Tables!$C$15=\"First Health POS\"),AB67,IF(Tables!$C$15=\"WPS Statewide\",AO25,AB25)))","v":0},null,null,null,null,null,null,null,null,null,null,null,null,null,null,null,null,{"$f":"Tables!Y20","v":"WPS PPO HDHP Silver $3,500"},{"$f":"Tables!Z20","v":"81974WI1930050"},{"$f":"DOLLAR(Tables!AD20,0)&\"/\"&DOLLAR(Tables!AM20,0)&\" Ded, \"&Tables!AE20&\"/\"&Tables!AN20&\" Coins, \"&DOLLAR(Tables!AF20,0)&\"/\"&DOLLAR(Tables!AO20,0)&\" OOP\"","v":"$3,500/$7,000 Ded, 20%/50% Coins, $8,300/$17,000 OOP"},"Embedded",{"$f":"Tables!AL20","v":"D/C"},{"$f":"Tables!AG20","v":"D/C"},{"$f":"Tables!AH20","v":"D/C"},{"$f":"Tables!AI20","v":"D/C"},{"$f":"Tables!AJ20","v":"D/C"},0,{"$f":"Tables!AW20","v":"Plan Deductible, then Coinsurance"},{"$f":"IF(Tables!$B$4=\"WPS Health Plan\",0,ROUND('Rating Formula'!$C$7*Tables!AA20*'Rating Formula'!$C$10,2)*'Rating Formula'!$C$16)","v":{"$error":"#N/A"}}]
[null,{"$f":"IF(AND(Tables!$B$4=\"WPS\",Tables!$C$15=\"First Health\"),AD47,IF(AND(Tables!$B$4=\"WPS Health Plan\",Tables!$C$15=\"First Health POS\"),Q68,IF(AND(Tables!$B$4=\"WPS\",Tables!$C$15=\"WPS Statewide\"),AD26,Q26)))","v":0},{"$f":"IF(AND(Tables!$B$4=\"WPS\",Tables!$C$15=\"First Health\"),AE47,IF(AND(Tables!$B$4=\"WPS Health Plan\",Tables!$C$15=\"First Health POS\"),R68,IF(Tables!$C$15=\"WPS Statewide\",AE26,R26)))","v":0},{"$f":"IF(AND(Tables!$B$4=\"WPS\",Tables!$C$15=\"First Health\"),AF47,IF(AND(Tables!$B$4=\"WPS Health Plan\",Tables!$C$15=\"First Health POS\"),S68,IF(Tables!$C$15=\"WPS Statewide\",AF26,S26)))","v":0},{"$f":"IF(AND(Tables!$B$4=\"WPS\",Tables!$C$15=\"First Health\"),AG47,IF(AND(Tables!$B$4=\"WPS Health Plan\",Tables!$C$15=\"First Health POS\"),T68,IF(Tables!$C$15=\"WPS Statewide\",AG26,T26)))","v":0},{"$f":"IF(AND(Tables!$B$4=\"WPS\",Tables!$C$15=\"First Health\"),AH47,IF(AND(Tables!$B$4=\"WPS Health Plan\",Tables!$C$15=\"First Health POS\"),U68,IF(Tables!$C$15=\"WPS Statewide\",AH26,U26)))","v":0},{"$f":"IF(AND(Tables!$B$4=\"WPS\",Tables!$C$15=\"First Health\"),AI47,IF(AND(Tables!$B$4=\"WPS Health Plan\",Tables!$C$15=\"First Health POS\"),V68,IF(Tables!$C$15=\"WPS Statewide\",AI26,V26)))","v":0},{"$f":"IF(AND(Tables!$B$4=\"WPS\",Tables!$C$15=\"First Health\"),AJ47,IF(AND(Tables!$B$4=\"WPS Health Plan\",Tables!$C$15=\"First Health POS\"),W68,IF(Tables!$C$15=\"WPS Statewide\",AJ26,W26)))","v":0},{"$f":"IF(AND(Tables!$B$4=\"WPS\",Tables!$C$15=\"First Health\"),AK47,IF(AND(Tables!$B$4=\"WPS Health Plan\",Tables!$C$15=\"First Health POS\"),X68,IF(Tables!$C$15=\"WPS Statewide\",AK26,X26)))","v":0},{"$f":"IF(AND(Tables!$B$4=\"WPS\",Tables!$C$15=\"First Health\"),AL47,IF(AND(Tables!$B$4=\"WPS Health Plan\",Tables!$C$15=\"First Health POS\"),Y68,IF(Tables!$C$15=\"WPS Statewide\",AL26,Y26)))","v":0},{"$f":"IF(AND(Tables!$B$4=\"WPS\",Tables!$C$15=\"First Health\"),AM47,IF(AND(Tables!$B$4=\"WPS Health Plan\",Tables!$C$15=\"First Health POS\"),Z68,IF(Tables!$C$15=\"WPS Statewide\",AM26,Z26)))","v":0},{"$f":"IF(AND(Tables!$B$4=\"WPS\",Tables!$C$15=\"First Health\"),AN47,IF(AND(Tables!$B$4=\"WPS Health Plan\",Tables!$C$15=\"First Health POS\"),AA68,IF(Tables!$C$15=\"WPS Statewide\",AN26,AA26)))","v":0},{"$f":"IF(AND(Tables!$B$4=\"WPS\",Tables!$C$15=\"First Health\"),AO47,IF(AND(Tables!$B$4=\"WPS Health Plan\",Tables!$C$15=\"First Health POS\"),AB68,IF(Tables!$C$15=\"WPS Statewide\",AO26,AB26)))","v":0},null,null,null,null,null,null,null,null,null,null,null,null,null,null,null,null,{"$f":"Tables!Y21","v":"WPS PPO HDHP Silver $4,000"},{"$f":"Tables!Z21","v":"81974WI1930025"},{"$f":"DOLLAR(Tables!AD21,0)&\"/\"&DOLLAR(Tables!AM21,0)&\" Ded, \"&Tables!AE21&\"/\"&Tables!AN21&\" Coins, \"&DOLLAR(Tables!AF21,0)&\"/\"&DOLLAR(Tables!AO21,0)&\" OOP\"","v":"$4,000/$8,000 Ded, 30%/50% Coins, $7,500/$18,000 OOP"},"Embedded",{"$f":"Tables!AL21","v":"D/C"},{"$f":"Tables!AG21","v":"D/C"},{"$f":"Tables!AH21","v":"D/C"},{"$f":"Tables!AI21","v":"D/C"},{"$f":"Tables!AJ21","v":"D/C"},0,{"$f":"Tables!AW21","v":"Plan Deductible, then Coinsurance"},{"$f":"IF(Tables!$B$4=\"WPS Health Plan\",0,ROUND('Rating Formula'!$C$7*Tables!AA21*'Rating Formula'!$C$10,2)*'Rating Formula'!$C$16)","v":{"$error":"#N/A"}}]
[null,{"$f":"IF(AND(Tables!$B$4=\"WPS\",Tables!$C$15=\"First Health\"),AD48,IF(AND(Tables!$B$4=\"WPS Health Plan\",Tables!$C$15=\"First Health POS\"),Q69,IF(AND(Tables!$B$4=\"WPS\",Tables!$C$15=\"WPS Statewide\"),AD27,Q27)))","v":0},{"$f":"IF(AND(Tables!$B$4=\"WPS\",Tables!$C$15=\"First Health\"),AE48,IF(AND(Tables!$B$4=\"WPS Health Plan\",Tables!$C$15=\"First Health POS\"),R69,IF(Tables!$C$15=\"WPS Statewide\",AE27,R27)))","v":0},{"$f":"IF(AND(Tables!$B$4=\"WPS\",Tables!$C$15=\"First Health\"),AF48,IF(AND(Tables!$B$4=\"WPS Health Plan\",Tables!$C$15=\"First Health POS\"),S69,IF(Tables!$C$15=\"WPS Statewide\",AF27,S27)))","v":0},{"$f":"IF(AND(Tables!$B$4=\"WPS\",Tables!$C$15=\"First Health\"),AG48,IF(AND(Tables!$B$4=\"WPS Health Plan\",Tables!$C$15=\"First Health POS\"),T69,IF(Tables!$C$15=\"WPS Statewide\",AG27,T27)))","v":0},{"$f":"IF(AND(Tables!$B$4=\"WPS\",Tables!$C$15=\"First Health\"),AH48,IF(AND(Tables!$B$4=\"WPS Health Plan\",Tables!$C$15=\"First Health POS\"),U69,IF(Tables!$C$15=\"WPS Statewide\",AH27,U27)))","v":0},{"$f":"IF(AND(Tables!$B$4=\"WPS\",Tables!$C$15=\"First Health\"),AI48,IF(AND(Tables!$B$4=\"WPS Health Plan\",Tables!$C$15=\"First Health POS\"),V69,IF(Tables!$C$15=\"WPS Statewide\",AI27,V27)))","v":0},{"$f":"IF(AND(Tables!$B$4=\"WPS\",Tables!$C$15=\"First Health\"),AJ48,IF(AND(Tables!$B$4=\"WPS Health Plan\",Tables!$C$15=\"First Health POS\"),W69,IF(Tables!$C$15=\"WPS Statewide\",AJ27,W27)))","v":0},{"$f":"IF(AND(Tables!$B$4=\"WPS\",Tables!$C$15=\"First Health\"),AK48,IF(AND(Tables!$B$4=\"WPS Health Plan\",Tables!$C$15=\"First Health POS\"),X69,IF(Tables!$C$15=\"WPS Statewide\",AK27,X27)))","v":0},{"$f":"IF(AND(Tables!$B$4=\"WPS\",Tables!$C$15=\"First Health\"),AL48,IF(AND(Tables!$B$4=\"WPS Health Plan\",Tables!$C$15=\"First Health POS\"),Y69,IF(Tables!$C$15=\"WPS Statewide\",AL27,Y27)))","v":0},{"$f":"IF(AND(Tables!$B$4=\"WPS\",Tables!$C$15=\"First Health\"),AM48,IF(AND(Tables!$B$4=\"WPS Health Plan\",Tables!$C$15=\"First Health POS\"),Z69,IF(Tables!$C$15=\"WPS Statewide\",AM27,Z27)))","v":0},{"$f":"IF(AND(Tables!$B$4=\"WPS\",Tables!$C$15=\"First Health\"),AN48,IF(AND(Tables!$B$4=\"WPS Health Plan\",Tables!$C$15=\"First Health POS\"),AA69,IF(Tables!$C$15=\"WPS Statewide\",AN27,AA27)))","v":0},{"$f":"IF(AND(Tables!$B$4=\"WPS\",Tables!$C$15=\"First Health\"),AO48,IF(AND(Tables!$B$4=\"WPS Health Plan\",Tables!$C$15=\"First Health POS\"),AB69,IF(Tables!$C$15=\"WPS Statewide\",AO27,AB27)))","v":0},null,null,null,null,null,null,null,null,null,null,null,null,null,null,null,null,{"$f":"Tables!Y22","v":"WPS PPO HDHP Silver $5,100"},{"$f":"Tables!Z22","v":"81974WI1930037"},{"$f":"DOLLAR(Tables!AD22,0)&\"/\"&DOLLAR(Tables!AM22,0)&\" Ded, \"&Tables!AE22&\"/\"&Tables!AN22&\" Coins, \"&DOLLAR(Tables!AF22,0)&\"/\"&DOLLAR(Tables!AO22,0)&\" OOP\"","v":"$5,100/$10,200 Ded, 0%/30% Coins, $5,100/$16,200 OOP"},"Embedded",{"$f":"Tables!AL22","v":"D/C"},{"$f":"Tables!AG22","v":"D/C"},{"$f":"Tables!AH22","v":"D/C"},{"$f":"Tables!AI22","v":"D/C"},{"$f":"Tables!AJ22","v":"D/C"},0,{"$f":"Tables!AW22","v":"Plan Deductible, then Coinsurance"},{"$f":"IF(Tables!$B$4=\"WPS Health Plan\",0,ROUND('Rating Formula'!$C$7*Tables!AA22*'Rating Formula'!$C$10,2)*'Rating Formula'!$C$16)","v":{"$error":"#N/A"}}]
[null,{"$f":"IF(AND(Tables!$B$4=\"WPS\",Tables!$C$15=\"First Health\"),AD49,IF(AND(Tables!$B$4=\"WPS Health Plan\",Tables!$C$15=\"First Health POS\"),Q70,IF(AND(Tables!$B$4=\"WPS\",Tables!$C$15=\"WPS Statewide\"),AD28,Q28)))","v":0},{"$f":"IF(AND(Tables!$B$4=\"WPS\",Tables!$C$15=\"First Health\"),AE49,IF(AND(Tables!$B$4=\"WPS Health Plan\",Tables!$C$15=\"First Health POS\"),R70,IF(Tables!$C$15=\"WPS Statewide\",AE28,R28)))","v":0},{"$f":"IF(AND(Tables!$B$4=\"WPS\",Tables!$C$15=\"First Health\"),AF49,IF(AND(Tables!$B$4=\"WPS Health Plan\",Tables!$C$15=\"First Health POS\"),S70,IF(Tables!$C$15=\"WPS Statewide\",AF28,S28)))","v":0},{"$f":"IF(AND(Tables!$B$4=\"WPS\",Tables!$C$15=\"First Health\"),AG49,IF(AND(Tables!$B$4=\"WPS Health Plan\",Tables!$C$15=\"First Health POS\"),T70,IF(Tables!$C$15=\"WPS Statewide\",AG28,T28)))","v":0},{"$f":"IF(AND(Tables!$B$4=\"WPS\",Tables!$C$15=\"First Health\"),AH49,IF(AND(Tables!$B$4=\"WPS Health Plan\",Tables!$C$15=\"First Health POS\"),U70,IF(Tables!$C$15=\"WPS Statewide\",AH28,U28)))","v":0},{"$f":"IF(AND(Tables!$B$4=\"WPS\",Tables!$C$15=\"First Health\"),AI49,IF(AND(Tables!$B$4=\"WPS Health Plan\",Tables!$C$15=\"First Health POS\"),V70,IF(Tables!$C$15=\"WPS Statewide\",AI28,V28)))","v":0},{"$f":"IF(AND(Tables!$B$4=\"WPS\",Tables!$C$15=\"First Health\"),AJ49,IF(AND(Tables!$B$4=\"WPS Health Plan\",Tables!$C$15=\"First Health POS\"),W70,IF(Tables!$C$15=\"WPS Statewide\",AJ28,W28)))","v":0},{"$f":"IF(AND(Tables!$B$4=\"WPS\",Tables!$C$15=\"First Health\"),AK49,IF(AND(Tables!$B$4=\"WPS Health Plan\",Tables!$C$15=\"First Health POS\"),X70,IF(Tables!$C$15=\"WPS Statewide\",AK28,X28)))","v":0},{"$f":"IF(AND(Tables!$B$4=\"WPS\",Tables!$C$15=\"First Health\"),AL49,IF(AND(Tables!$B$4=\"WPS Health Plan\",Tables!$C$15=\"First Health POS\"),Y70,IF(Tables!$C$15=\"WPS Statewide\",AL28,Y28)))","v":0},{"$f":"IF(AND(Tables!$B$4=\"WPS\",Tables!$C$15=\"First Health\"),AM49,IF(AND(Tables!$B$4=\"WPS Health Plan\",Tables!$C$15=\"First Health POS\"),Z70,IF(Tables!$C$15=\"WPS Statewide\",AM28,Z28)))","v":0},{"$f":"IF(AND(Tables!$B$4=\"WPS\",Tables!$C$15=\"First Health\"),AN49,IF(AND(Tables!$B$4=\"WPS Health Plan\",Tables!$C$15=\"First Health POS\"),AA70,IF(Tables!$C$15=\"WPS Statewide\",AN28,AA28)))","v":0},{"$f":"IF(AND(Tables!$B$4=\"WPS\",Tables!$C$15=\"First Health\"),AO49,IF(AND(Tables!$B$4=\"WPS Health Plan\",Tables!$C$15=\"First Health POS\"),AB70,IF(Tables!$C$15=\"WPS Statewide\",AO28,AB28)))","v":0},null,null,null,null,null,null,null,null,null,null,null,null,null,null,null,null,{"$f":"Tables!Y23","v":"WPS PPO HDHP Silver $6,000"},{"$f":"Tables!Z23","v":"81974WI1930051"},{"$f":"DOLLAR(Tables!AD23,0)&\"/\"&DOLLAR(Tables!AM23,0)&\" Ded, \"&Tables!AE23&\"/\"&Tables!AN23&\" Coins, \"&DOLLAR(Tables!AF23,0)&\"/\"&DOLLAR(Tables!AO23,0)&\" OOP\"","v":"$6,000/$12,000 Ded, 0%/30% Coins, $6,000/$18,000 OOP"},"Embedded",{"$f":"Tables!AL23","v":"D/C"},{"$f":"Tables!AG23","v":"D/C"},{"$f":"Tables!AH23","v":"D/C"},{"$f":"Tables!AI23","v":"D/C"},{"$f":"Tables!AJ23","v":"D/C"},0,{"$f":"Tables!AW23","v":"Plan Deductible, then Coinsurance"},{"$f":"IF(Tables!$B$4=\"WPS Health Plan\",0,ROUND('Rating Formula'!$C$7*Tables!AA23*'Rating Formula'!$C$10,2)*'Rating Formula'!$C$16)","v":{"$error":"#N/A"}}]
[null,{"$f":"IF(AND(Tables!$B$4=\"WPS\",Tables!$C$15=\"First Health\"),AD50,IF(AND(Tables!$B$4=\"WPS Health Plan\",Tables!$C$15=\"First Health POS\"),Q71,IF(AND(Tables!$B$4=\"WPS\",Tables!$C$15=\"WPS Statewide\"),AD29,Q29)))","v":0},{"$f":"IF(AND(Tables!$B$4=\"WPS\",Tables!$C$15=\"First Health\"),AE50,IF(AND(Tables!$B$4=\"WPS Health Plan\",Tables!$C$15=\"First Health POS\"),R71,IF(Tables!$C$15=\"WPS Statewide\",AE29,R29)))","v":0},{"$f":"IF(AND(Tables!$B$4=\"WPS\",Tables!$C$15=\"First Health\"),AF50,IF(AND(Tables!$B$4=\"WPS Health Plan\",Tables!$C$15=\"First Health POS\"),S71,IF(Tables!$C$15=\"WPS Statewide\",AF29,S29)))","v":0},{"$f":"IF(AND(Tables!$B$4=\"WPS\",Tables!$C$15=\"First Health\"),AG50,IF(AND(Tables!$B$4=\"WPS Health Plan\",Tables!$C$15=\"First Health POS\"),T71,IF(Tables!$C$15=\"WPS Statewide\",AG29,T29)))","v":0},{"$f":"IF(AND(Tables!$B$4=\"WPS\",Tables!$C$15=\"First Health\"),AH50,IF(AND(Tables!$B$4=\"WPS Health Plan\",Tables!$C$15=\"First Health POS\"),U71,IF(Tables!$C$15=\"WPS Statewide\",AH29,U29)))","v":0},{"$f":"IF(AND(Tables!$B$4=\"WPS\",Tables!$C$15=\"First Health\"),AI50,IF(AND(Tables!$B$4=\"WPS Health Plan\",Tables!$C$15=\"First Health POS\"),V71,IF(Tables!$C$15=\"WPS Statewide\",AI29,V29)))","v":0},{"$f":"IF(AND(Tables!$B$4=\"WPS\",Tables!$C$15=\"First Health\"),AJ50,IF(AND(Tables!$B$4=\"WPS Health Plan\",Tables!$C$15=\"First Health POS\"),W71,IF(Tables!$C$15=\"WPS Statewide\",AJ29,W29)))","v":0},{"$f":"IF(AND(Tables!$B$4=\"WPS\",Tables!$C$15=\"First Health\"),AK50,IF(AND(Tables!$B$4=\"WPS Health Plan\",Tables!$C$15=\"First Health POS\"),X71,IF(Tables!$C$15=\"WPS Statewide\",AK29,X29)))","v":0},{"$f":"IF(AND(Tables!$B$4=\"WPS\",Tables!$C$15=\"First Health\"),AL50,IF(AND(Tables!$B$4=\"WPS Health Plan\",Tables!$C$15=\"First Health POS\"),Y71,IF(Tables!$C$15=\"WPS Statewide\",AL29,Y29)))","v":0},{"$f":"IF(AND(Tables!$B$4=\"WPS\",Tables!$C$15=\"First Health\"),AM50,IF(AND(Tables!$B$4=\"WPS Health Plan\",Tables!$C$15=\"First Health POS\"),Z71,IF(Tables!$C$15=\"WPS Statewide\",AM29,Z29)))","v":0},{"$f":"IF(AND(Tables!$B$4=\"WPS\",Tables!$C$15=\"First Health\"),AN50,IF(AND(Tables!$B$4=\"WPS Health Plan\",Tables!$C$15=\"First Health POS\"),AA71,IF(Tables!$C$15=\"WPS Statewide\",AN29,AA29)))","v":0},{"$f":"IF(AND(Tables!$B$4=\"WPS\",Tables!$C$15=\"First Health\"),AO50,IF(AND(Tables!$B$4=\"WPS Health Plan\",Tables!$C$15=\"First Health POS\"),AB71,IF(Tables!$C$15=\"WPS Statewide\",AO29,AB29)))","v":0},null,null,null,null,null,null,null,null,null,null,null,null,null,null,null,null,{"$f":"Tables!Y24","v":"WPS PPO HDHP Bronze $6,500"},{"$f":"Tables!Z24","v":"81974WI1930027"},{"$f":"DOLLAR(Tables!AD24,0)&\"/\"&DOLLAR(Tables!AM24,0)&\" Ded, \"&Tables!AE24&\"/\"&Tables!AN24&\" Coins, \"&DOLLAR(Tables!AF24,0)&\"/\"&DOLLAR(Tables!AO24,0)&\" OOP\"","v":"$6,500/$13,000 Ded, 30%/50% Coins, $8,300/$23,000 OOP"},"Embedded",{"$f":"Tables!AL24","v":"D/C"},{"$f":"Tables!AG24","v":"D/C"},{"$f":"Tables!AH24","v":"D/C"},{"$f":"Tables!AI24","v":"D/C"},{"$f":"Tables!AJ24","v":"D/C"},0,{"$f":"Tables!AW24","v":"Plan Deductible, then Coinsurance"},{"$f":"IF(Tables!$B$4=\"WPS Health Plan\",0,ROUND('Rating Formula'!$C$7*Tables!AA24*'Rating Formula'!$C$10,2)*'Rating Formula'!$C$16)","v":{"$error":"#N/A"}}]
[null,{"$f":"IF(AND(Tables!$B$4=\"WPS\",Tables!$C$15=\"First Health\"),AD51,IF(AND(Tables!$B$4=\"WPS Health Plan\",Tables!$C$15=\"First Health POS\"),Q72,IF(AND(Tables!$B$4=\"WPS\",Tables!$C$15=\"WPS Statewide\"),AD30,Q30)))","v":0},{"$f":"IF(AND(Tables!$B$4=\"WPS\",Tables!$C$15=\"First Health\"),AE51,IF(AND(Tables!$B$4=\"WPS Health Plan\",Tables!$C$15=\"First Health POS\"),R72,IF(Tables!$C$15=\"WPS Statewide\",AE30,R30)))","v":0},{"$f":"IF(AND(Tables!$B$4=\"WPS\",Tables!$C$15=\"First Health\"),AF51,IF(AND(Tables!$B$4=\"WPS Health Plan\",Tables!$C$15=\"First Health POS\"),S72,IF(Tables!$C$15=\"WPS Statewide\",AF30,S30)))","v":0},{"$f":"IF(AND(Tables!$B$4=\"WPS\",Tables!$C$15=\"First Health\"),AG51,IF(AND(Tables!$B$4=\"WPS Health Plan\",Tables!$C$15=\"First Health POS\"),T72,IF(Tables!$C$15=\"WPS Statewide\",AG30,T30)))","v":0},{"$f":"IF(AND(Tables!$B$4=\"WPS\",Tables!$C$15=\"First Health\"),AH51,IF(AND(Tables!$B$4=\"WPS Health Plan\",Tables!$C$15=\"First Health POS\"),U72,IF(Tables!$C$15=\"WPS Statewide\",AH30,U30)))","v":0},{"$f":"IF(AND(Tables!$B$4=\"WPS\",Tables!$C$15=\"First Health\"),AI51,IF(AND(Tables!$B$4=\"WPS Health Plan\",Tables!$C$15=\"First Health POS\"),V72,IF(Tables!$C$15=\"WPS Statewide\",AI30,V30)))","v":0},{"$f":"IF(AND(Tables!$B$4=\"WPS\",Tables!$C$15=\"First Health\"),AJ51,IF(AND(Tables!$B$4=\"WPS Health Plan\",Tables!$C$15=\"First Health POS\"),W72,IF(Tables!$C$15=\"WPS Statewide\",AJ30,W30)))","v":0},{"$f":"IF(AND(Tables!$B$4=\"WPS\",Tables!$C$15=\"First Health\"),AK51,IF(AND(Tables!$B$4=\"WPS Health Plan\",Tables!$C$15=\"First Health POS\"),X72,IF(Tables!$C$15=\"WPS Statewide\",AK30,X30)))","v":0},{"$f":"IF(AND(Tables!$B$4=\"WPS\",Tables!$C$15=\"First Health\"),AL51,IF(AND(Tables!$B$4=\"WPS Health Plan\",Tables!$C$15=\"First Health POS\"),Y72,IF(Tables!$C$15=\"WPS Statewide\",AL30,Y30)))","v":0},{"$f":"IF(AND(Tables!$B$4=\"WPS\",Tables!$C$15=\"First Health\"),AM51,IF(AND(Tables!$B$4=\"WPS Health Plan\",Tables!$C$15=\"First Health POS\"),Z72,IF(Tables!$C$15=\"WPS Statewide\",AM30,Z30)))","v":0},{"$f":"IF(AND(Tables!$B$4=\"WPS\",Tables!$C$15=\"First Health\"),AN51,IF(AND(Tables!$B$4=\"WPS Health Plan\",Tables!$C$15=\"First Health POS\"),AA72,IF(Tables!$C$15=\"WPS Statewide\",AN30,AA30)))","v":0},{"$f":"IF(AND(Tables!$B$4=\"WPS\",Tables!$C$15=\"First Health\"),AO51,IF(AND(Tables!$B$4=\"WPS Health Plan\",Tables!$C$15=\"First Health POS\"),AB72,IF(Tables!$C$15=\"WPS Statewide\",AO30,AB30)))","v":0},null,null,null,null,null,null,null,null,null,null,null,null,null,null,null,null,{"$f":"Tables!Y25","v":"WPS PPO HDHP Bronze $8,300"},{"$f":"Tables!Z25","v":"81974WI1930026"},{"$f":"DOLLAR(Tables!AD25,0)&\"/\"&DOLLAR(Tables!AM25,0)&\" Ded, \"&Tables!AE25&\"/\"&Tables!AN25&\" Coins, \"&DOLLAR(Tables!AF25,0)&\"/\"&DOLLAR(Tables!AO25,0)&\" OOP\"","v":"$8,300/$16,600 Ded, 0%/30% Coins, $8,300/$22,600 OOP"},"Embedded",{"$f":"Tables!AL25","v":"D/C"},{"$f":"Tables!AG25","v":"D/C"},{"$f":"Tables!AH25","v":"D/C"},{"$f":"Tables!AI25","v":"D/C"},{"$f":"Tables!AJ25","v":"D/C"},0,{"$f":"Tables!AW25","v":"Plan Deductible, then Coinsurance"},{"$f":"IF(Tables!$B$4=\"WPS Health Plan\",0,ROUND('Rating Formula'!$C$7*Tables!AA25*'Rating Formula'!$C$10,2)*'Rating Formula'!$C$16)","v":{"$error":"#N/A"}}]
[null,{"$f":"IF(Tables!$B$4=\"WPS\",\"\",IF(AND(Tables!$B$4=\"WPS Health Plan\",Tables!$C$15=\"First Health POS\"),\"\",Q31))","v":""},{"$f":"IF(Tables!$B$4=\"WPS\",\"\",IF(AND(Tables!$B$4=\"WPS Health Plan\",Tables!$C$15=\"First Health POS\"),\"\",R31))","v":""},{"$f":"IF(Tables!$B$4=\"WPS\",\"\",IF(AND(Tables!$B$4=\"WPS Health Plan\",Tables!$C$15=\"First Health POS\"),\"\",S31))","v":""},null,{"$f":"IF(Tables!$B$4=\"WPS\",\"\",IF(AND(Tables!$B$4=\"WPS Health Plan\",Tables!$C$15=\"First Health POS\"),\"\",U31))","v":""},{"$f":"IF(Tables!$B$4=\"WPS\",\"\",IF(AND(Tables!$B$4=\"WPS Health Plan\",Tables!$C$15=\"First Health POS\"),\"\",V31))","v":""},{"$f":"IF(Tables!$B$4=\"WPS\",\"\",IF(AND(Tables!$B$4=\"WPS Health Plan\",Tables!$C$15=\"First Health POS\"),\"\",W31))","v":""},{"$f":"IF(Tables!$B$4=\"WPS\",\"\",IF(AND(Tables!$B$4=\"WPS Health Plan\",Tables!$C$15=\"First Health POS\"),\"\",X31))","v":""},{"$f":"IF(Tables!$B$4=\"WPS\",\"\",IF(AND(Tables!$B$4=\"WPS Health Plan\",Tables!$C$15=\"First Health POS\"),\"\",Y31))","v":""},{"$f":"IF(Tables!$B$4=\"WPS\",\"\",IF(AND(Tables!$B$4=\"WPS Health Plan\",Tables!$C$15=\"First Health POS\"),\"\",Z31))","v":""},{"$f":"IF(Tables!$B$4=\"WPS\",\"\",IF(AND(Tables!$B$4=\"WPS Health Plan\",Tables!$C$15=\"First Health POS\"),\"\",AA31))","v":""},{"$f":"IF(Tables!$B$4=\"WPS\",\"\",IF(AND(Tables!$B$4=\"WPS Health Plan\",Tables!$C$15=\"First Health POS\"),\"\",AB31))","v":""},null,null,null,null,null,null,null,null,null,null,null,null,null,null,null,null,{"$f":"Tables!Y26","v":"WPS PPO Platinum $500 OOS"},{"$f":"Tables!Z26","v":"81974WI1930002FH"},{"$f":"DOLLAR(Tables!AD26,0)&\"/\"&DOLLAR(Tables!AM26,0)&\" Ded, \"&Tables!AE26&\"/\"&Tables!AN26&\" Coins, \"&DOLLAR(Tables!AF26,0)&\"/\"&DOLLAR(Tables!AO26,0)&\" OOP\"","v":"$500/$1,000 Ded, 20%/50% Coins, $1,700/$11,000 OOP"}," ",{"$f":"Tables!AL26","v":500},{"$f":"Tables!AG26","v":0},{"$f":"Tables!AH26","v":10},{"$f":"Tables!AI26","v":35},{"$f":"Tables!AJ26","v":70},0,{"$f":"Tables!AW26","v":"$10 / $25 / $50 / $90 / D/C"},{"$f":"IF(Tables!$B$4=\"WPS Health Plan\",0,ROUND('Rating Formula'!$C$7*Tables!AA26*'Rating Formula'!$C$10,2)*'Rating Formula'!$C$16)","v":{"$error":"#N/A"}}]
[null,{"$f":"IF(Tables!$B$4=\"WPS\",\"\",IF(AND(Tables!$B$4=\"WPS Health Plan\",Tables!$C$15=\"First Health POS\"),\"\",Q32))","v":""},{"$f":"IF(Tables!$B$4=\"WPS\",\"\",IF(AND(Tables!$B$4=\"WPS Health Plan\",Tables!$C$15=\"First Health POS\"),\"\",R32))","v":""},{"$f":"IF(Tables!$B$4=\"WPS\",\"\",IF(AND(Tables!$B$4=\"WPS Health Plan\",Tables!$C$15=\"First Health POS\"),\"\",S32))","v":""},null,{"$f":"IF(Tables!$B$4=\"WPS\",\"\",IF(AND(Tables!$B$4=\"WPS Health Plan\",Tables!$C$15=\"First Health POS\"),\"\",U32))","v":""},{"$f":"IF(Tables!$B$4=\"WPS\",\"\",IF(AND(Tables!$B$4=\"WPS Health Plan\",Tables!$C$15=\"First Health POS\"),\"\",V32))","v":""},{"$f":"IF(Tables!$B$4=\"WPS\",\"\",IF(AND(Tables!$B$4=\"WPS Health Plan\",Tables!$C$15=\"First Health POS\"),\"\",W32))","v":""},{"$f":"IF(Tables!$B$4=\"WPS\",\"\",IF(AND(Tables!$B$4=\"WPS Health Plan\",Tables!$C$15=\"First Health POS\"),\"\",X32))","v":""},{"$f":"IF(Tables!$B$4=\"WPS\",\"\",IF(AND(Tables!$B$4=\"WPS Health Plan\",Tables!$C$15=\"First Health POS\"),\"\",Y32))","v":""},{"$f":"IF(Tables!$B$4=\"WPS\",\"\",IF(AND(Tables!$B$4=\"WPS Health Plan\",Tables!$C$15=\"First Health POS\"),\"\",Z32))","v":""},{"$f":"IF(Tables!$B$4=\"WPS\",\"\",IF(AND(Tables!$B$4=\"WPS Health Plan\",Tables!$C$15=\"First Health POS\"),\"\",AA32))","v":""},{"$f":"IF(Tables!$B$4=\"WPS\",\"\",IF(AND(Tables!$B$4=\"WPS Health Plan\",Tables!$C$15=\"First Health POS\"),\"\",AB32))","v":""},null,null,null,null,null,null,null,null,null,null,null,null,null,null,null,null,{"$f":"Tables!Y27","v":"WPS PPO Gold $1,000 OOS"},{"$f":"Tables!Z27","v":"81974WI1930009FH"},{"$f":"DOLLAR(Tables!AD27,0)&\"/\"&DOLLAR(Tables!AM27,0)&\" Ded, \"&Tables!AE27&\"/\"&Tables!AN27&\" Coins, \"&DOLLAR(Tables!AF27,0)&\"/\"&DOLLAR(Tables!AO27,0)&\" OOP\"","v":"$1,000/$2,000 Ded, 20%/50% Coins, $7,350/$12,000 OOP"}," ",{"$f":"Tables!AL27","v":500},{"$f":"Tables!AG27","v":0},{"$f":"Tables!AH27","v":10},{"$f":"Tables!AI27","v":35},{"$f":"Tables!AJ27","v":70},0,{"$f":"Tables!AW27","v":"$10 / $25 / $50 / $90 / D/C"},{"$f":"IF(Tables!$B$4=\"WPS Health Plan\",0,ROUND('Rating Formula'!$C$7*Tables!AA27*'Rating Formula'!$C$10,2)*'Rating Formula'!$C$16)","v":{"$error":"#N/A"}}]
[null,{"$f":"IF(Tables!$B$4=\"WPS\",\"\",IF(AND(Tables!$B$4=\"WPS Health Plan\",Tables!$C$15=\"First Health POS\"),\"\",Q33))","v":""},{"$f":"IF(Tables!$B$4=\"WPS\",\"\",IF(AND(Tables!$B$4=\"WPS Health Plan\",Tables!$C$15=\"First Health POS\"),\"\",R33))","v":""},{"$f":"IF(Tables!$B$4=\"WPS\",\"\",IF(AND(Tables!$B$4=\"WPS Health Plan\",Tables!$C$15=\"First Health POS\"),\"\",S33))","v":""},null,{"$f":"IF(Tables!$B$4=\"WPS\",\"\",IF(AND(Tables!$B$4=\"WPS Health Plan\",Tables!$C$15=\"First Health POS\"),\"\",U33))","v":""},{"$f":"IF(Tables!$B$4=\"WPS\",\"\",IF(AND(Tables!$B$4=\"WPS Health Plan\",Tables!$C$15=\"First Health POS\"),\"\",V33))","v":""},{"$f":"IF(Tables!$B$4=\"WPS\",\"\",IF(AND(Tables!$B$4=\"WPS Health Plan\",Tables!$C$15=\"First Health POS\"),\"\",W33))","v":""},{"$f":"IF(Tables!$B$4=\"WPS\",\"\",IF(AND(Tables!$B$4=\"WPS Health Plan\",Tables!$C$15=\"First Health POS\"),\"\",X33))","v":""},{"$f":"IF(Tables!$B$4=\"WPS\",\"\",IF(AND(Tables!$B$4=\"WPS Health Plan\",Tables!$C$15=\"First Health POS\"),\"\",Y33))","v":""},{"$f":"IF(Tables!$B$4=\"WPS\",\"\",IF(AND(Tables!$B$4=\"WPS Health Plan\",Tables!$C$15=\"First Health POS\"),\"\",Z33))","v":""},{"$f":"IF(Tables!$B$4=\"WPS\",\"\",IF(AND(Tables!$B$4=\"WPS Health Plan\",Tables!$C$15=\"First Health POS\"),\"\",AA33))","v":""},{"$f":"IF(Tables!$B$4=\"WPS\",\"\",IF(AND(Tables!$B$4=\"WPS Health Plan\",Tables!$C$15=\"First Health POS\"),\"\",AB33))","v":""},null,null,null,null,null,null,null,null,null,null,null,null,null,null,null,null,{"$f":"Tables!Y28","v":"WPS PPO Gold $1,500 OOS"},{"$f":"Tables!Z28","v":"81974WI1930040FH"},{"$f":"DOLLAR(Tables!AD28,0)&\"/\"&DOLLAR(Tables!AM28,0)&\" Ded, \"&Tables!AE28&\"/\"&Tables!AN28&\" Coins, \"&DOLLAR(Tables!AF28,0)&\"/\"&DOLLAR(Tables!AO28,0)&\" OOP\"","v":"$1,500/$3,000 Ded, 10%/50% Coins, $6,750/$13,000 OOP"}," ",{"$f":"Tables!AL28","v":500},{"$f":"Tables!AG28","v":0},{"$f":"Tables!AH28","v":10},{"$f":"Tables!AI28","v":35},{"$f":"Tables!AJ28","v":70},0,{"$f":"Tables!AW28","v":"$10 / $25 / $50 / $90 / D/C"},{"$f":"IF(Tables!$B$4=\"WPS Health Plan\",0,ROUND('Rating Formula'!$C$7*Tables!AA28*'Rating Formula'!$C$10,2)*'Rating Formula'!$C$16)","v":{"$error":"#N/A"}}]
[null,{"$f":"IF(Tables!$B$4=\"WPS\",\"\",IF(AND(Tables!$B$4=\"WPS Health Plan\",Tables!$C$15=\"First Health POS\"),\"\",Q34))","v":""},{"$f":"IF(Tables!$B$4=\"WPS\",\"\",IF(AND(Tables!$B$4=\"WPS Health Plan\",Tables!$C$15=\"First Health POS\"),\"\",R34))","v":""},{"$f":"IF(Tables!$B$4=\"WPS\",\"\",IF(AND(Tables!$B$4=\"WPS Health Plan\",Tables!$C$15=\"First Health POS\"),\"\",S34))","v":""},null,{"$f":"IF(Tables!$B$4=\"WPS\",\"\",IF(AND(Tables!$B$4=\"WPS Health Plan\",Tables!$C$15=\"First Health POS\"),\"\",U34))","v":""},{"$f":"IF(Tables!$B$4=\"WPS\",\"\",IF(AND(Tables!$B$4=\"WPS Health Plan\",Tables!$C$15=\"First Health POS\"),\"\",V34))","v":""},{"$f":"IF(Tables!$B$4=\"WPS\",\"\",IF(AND(Tables!$B$4=\"WPS Health Plan\",Tables!$C$15=\"First Health POS\"),\"\",W34))","v":""},{"$f":"IF(Tables!$B$4=\"WPS\",\"\",IF(AND(Tables!$B$4=\"WPS Health Plan\",Tables!$C$15=\"First Health POS\"),\"\",X34))","v":""},{"$f":"IF(Tables!$B$4=\"WPS\",\"\",IF(AND(Tables!$B$4=\"WPS Health Plan\",Tables!$C$15=\"First Health POS\"),\"\",Y34))","v":""},{"$f":"IF(Tables!$B$4=\"WPS\",\"\",IF(AND(Tables!$B$4=\"WPS Health Plan\",Tables!$C$15=\"First Health POS\"),\"\",Z34))","v":""},{"$f":"IF(Tables!$B$4=\"WPS\",\"\",IF(AND(Tables!$B$4=\"WPS Health Plan\",Tables!$C$15=\"First Health POS\"),\"\",AA34))","v":""},{"$f":"IF(Tables!$B$4=\"WPS\",\"\",IF(AND(Tables!$B$4=\"WPS Health Plan\",Tables!$C$15=\"First Health POS\"),\"\",AB34))","v":""},null,null,null,null,null,null,null,null,null,null,null,null,null,null,null,null,{"$f":"Tables!Y29","v":"WPS PPO Gold $2,000 OOS"},{"$f":"Tables!Z29","v":"81974WI1930041FH"},{"$f":"DOLLAR(Tables!AD29,0)&\"/\"&DOLLAR(Tables!AM29,0)&\" Ded, \"&Tables!AE29&\"/\"&Tables!AN29&\" Coins, \"&DOLLAR(Tables!AF29,0)&\"/\"&DOLLAR(Tables!AO29,0)&\" OOP\"","v":"$2,000/$4,000 Ded, 20%/50% Coins, $5,950/$14,000 OOP"}," ",{"$f":"Tables!AL29","v":500},{"$f":"Tables!AG29","v":0},{"$f":"Tables!AH29","v":10},{"$f":"Tables!AI29","v":35},{"$f":"Tables!AJ29","v":70},0,{"$f":"Tables!AW29","v":"$10 / $25 / $50 / $90 / D/C"},{"$f":"IF(Tables!$B$4=\"WPS Health Plan\",0,ROUND('Rating Formula'!$C$7*Tables!AA29*'Rating Formula'!$C$10,2)*'Rating Formula'!$C$16)","v":{"$error":"#N/A"}}]
[null,{"$f":"IF(Tables!$B$4=\"WPS\",\"\",IF(AND(Tables!$B$4=\"WPS Health Plan\",Tables!$C$15=\"First Health POS\"),\"\",Q35))","v":""},{"$f":"IF(Tables!$B$4=\"WPS\",\"\",IF(AND(Tables!$B$4=\"WPS Health Plan\",Tables!$C$15=\"First Health POS\"),\"\",R35))","v":""},{"$f":"IF(Tables!$B$4=\"WPS\",\"\",IF(AND(Tables!$B$4=\"WPS Health Plan\",Tables!$C$15=\"First Health POS\"),\"\",S35))","v":""},null,{"$f":"IF(Tables!$B$4=\"WPS\",\"\",IF(AND(Tables!$B$4=\"WPS Health Plan\",Tables!$C$15=\"First Health POS\"),\"\",U35))","v":""},{"$f":"IF(Tables!$B$4=\"WPS\",\"\",IF(AND(Tables!$B$4=\"WPS Health Plan\",Tables!$C$15=\"First Health POS\"),\"\",V35))","v":""},{"$f":"IF(Tables!$B$4=\"WPS\",\"\",IF(AND(Tables!$B$4=\"WPS Health Plan\",Tables!$C$15=\"First Health POS\"),\"\",W35))","v":""},{"$f":"IF(Tables!$B$4=\"WPS\",\"\",IF(AND(Tables!$B$4=\"WPS Health Plan\",Tables!$C$15=\"First Health POS\"),\"\",X35))","v":""},{"$f":"IF(Tables!$B$4=\"WPS\",\"\",IF(AND(Tables!$B$4=\"WPS Health Plan\",Tables!$C$15=\"First Health POS\"),\"\",Y35))","v":""},{"$f":"IF(Tables!$B$4=\"WPS\",\"\",IF(AND(Tables!$B$4=\"WPS Health Plan\",Tables!$C$15=\"First Health POS\"),\"\",Z35))","v":""},{"$f":"IF(Tables!$B$4=\"WPS\",\"\",IF(AND(Tables!$B$4=\"WPS Health Plan\",Tables!$C$15=\"First Health POS\"),\"\",AA35))","v":""},{"$f":"IF(Tables!$B$4=\"WPS\",\"\",IF(AND(Tables!$B$4=\"WPS Health Plan\",Tables!$C$15=\"First Health POS\"),\"\",AB35))","v":""},null,null,null,null,null,null,null,null,null,null,null,null,null,null,null,null,{"$f":"Tables!Y30","v":"WPS PPO Gold $2,500 OOS"},{"$f":"Tables!Z30","v":"81974WI1930042FH"},{"$f":"DOLLAR(Tables!AD30,0)&\"/\"&DOLLAR(Tables!AM30,0)&\" Ded, \"&Tables!AE30&\"/\"&Tables!AN30&\" Coins, \"&DOLLAR(Tables!AF30,0)&\"/\"&DOLLAR(Tables!AO30,0)&\" OOP\"","v":"$2,500/$5,000 Ded, 20%/50% Coins, $5,800/$15,000 OOP"}," ",{"$f":"Tables!AL30","v":500},{"$f":"Tables!AG30","v":0},{"$f":"Tables!AH30","v":10},{"$f":"Tables!AI30","v":35},{"$f":"Tables!AJ30","v":70},0,{"$f":"Tables!AW30","v":"$10 / $25 / $50 / $90 / D/C"},{"$f":"IF(Tables!$B$4=\"WPS Health Plan\",0,ROUND('Rating Formula'!$C$7*Tables!AA30*'Rating Formula'!$C$10,2)*'Rating Formula'!$C$16)","v":{"$error":"#N/A"}}]
[null,{"$f":"IF(Tables!$B$4=\"WPS\",\"\",IF(AND(Tables!$B$4=\"WPS Health Plan\",Tables!$C$15=\"First Health POS\"),\"\",Q36))","v":""},{"$f":"IF(Tables!$B$4=\"WPS\",\"\",IF(AND(Tables!$B$4=\"WPS Health Plan\",Tables!$C$15=\"First Health POS\"),\"\",R36))","v":""},{"$f":"IF(Tables!$B$4=\"WPS\",\"\",IF(AND(Tables!$B$4=\"WPS Health Plan\",Tables!$C$15=\"First Health POS\"),\"\",S36))","v":""},null,{"$f":"IF(Tables!$B$4=\"WPS\",\"\",IF(AND(Tables!$B$4=\"WPS Health Plan\",Tables!$C$15=\"First Health POS\"),\"\",U36))","v":""},{"$f":"IF(Tables!$B$4=\"WPS\",\"\",IF(AND(Tables!$B$4=\"WPS Health Plan\",Tables!$C$15=\"First Health POS\"),\"\",V36))","v":""},{"$f":"IF(Tables!$B$4=\"WPS\",\"\",IF(AND(Tables!$B$4=\"WPS Health Plan\",Tables!$C$15=\"First Health POS\"),\"\",W36))","v":""},{"$f":"IF(Tables!$B$4=\"WPS\",\"\",IF(AND(Tables!$B$4=\"WPS Health Plan\",Tables!$C$15=\"First Health POS\"),\"\",X36))","v":""},{"$f":"IF(Tables!$B$4=\"WPS\",\"\",IF(AND(Tables!$B$4=\"WPS Health Plan\",Tables!$C$15=\"First Health POS\"),\"\",Y36))","v":""},{"$f":"IF(Tables!$B$4=\"WPS\",\"\",IF(AND(Tables!$B$4=\"WPS Health Plan\",Tables!$C$15=\"First Health POS\"),\"\",Z36))","v":""},{"$f":"IF(Tables!$B$4=\"WPS\",\"\",IF(AND(Tables!$B$4=\"WPS Health Plan\",Tables!$C$15=\"First Health POS\"),\"\",AA36))","v":""},{"$f":"IF(Tables!$B$4=\"WPS\",\"\",IF(AND(Tables!$B$4=\"WPS Health Plan\",Tables!$C$15=\"First Health POS\"),\"\",AB36))","v":""},null,null,null,null,null,null,null,null,null,null,null,null,null,null,null,null,{"$f":"Tables!Y31","v":"WPS PPO Silver $5,000 OOS"},{"$f":"Tables!Z31","v":"81974WI1930033FH"},{"$f":"DOLLAR(Tables!AD31,0)&\"/\"&DOLLAR(Tables!AM31,0)&\" Ded, \"&Tables!AE31&\"/\"&Tables!AN31&\" Coins, \"&DOLLAR(Tables!AF31,0)&\"/\"&DOLLAR(Tables!AO31,0)&\" OOP\"","v":"$5,000/$10,000 Ded, 25%/50% Coins, $9,200/$20,000 OOP"}," ",{"$f":"Tables!AL31","v":750},{"$f":"Tables!AG31","v":0},{"$f":"Tables!AH31","v":10},{"$f":"Tables!AI31","v":50},{"$f":"Tables!AJ31","v":100},0,{"$f":"Tables!AW31","v":"$20 / $40 / $80 / $125 / D/C"},{"$f":"IF(Tables!$B$4=\"WPS Health Plan\",0,ROUND('Rating Formula'!$C$7*Tables!AA31*'Rating Formula'!$C$10,2)*'Rating Formula'!$C$16)","v":{"$error":"#N/A"}}]
[null,{"$f":"IF(Tables!$B$4=\"WPS\",\"\",IF(AND(Tables!$B$4=\"WPS Health Plan\",Tables!$C$15=\"First Health POS\"),\"\",Q37))","v":""},{"$f":"IF(Tables!$B$4=\"WPS\",\"\",IF(AND(Tables!$B$4=\"WPS Health Plan\",Tables!$C$15=\"First Health POS\"),\"\",R37))","v":""},{"$f":"IF(Tables!$B$4=\"WPS\",\"\",IF(AND(Tables!$B$4=\"WPS Health Plan\",Tables!$C$15=\"First Health POS\"),\"\",S37))","v":""},null,{"$f":"IF(Tables!$B$4=\"WPS\",\"\",IF(AND(Tables!$B$4=\"WPS Health Plan\",Tables!$C$15=\"First Health POS\"),\"\",U37))","v":""},{"$f":"IF(Tables!$B$4=\"WPS\",\"\",IF(AND(Tables!$B$4=\"WPS Health Plan\",Tables!$C$15=\"First Health POS\"),\"\",V37))","v":""},{"$f":"IF(Tables!$B$4=\"WPS\",\"\",IF(AND(Tables!$B$4=\"WPS Health Plan\",Tables!$C$15=\"First Health POS\"),\"\",W37))","v":""},{"$f":"IF(Tables!$B$4=\"WPS\",\"\",IF(AND(Tables!$B$4=\"WPS Health Plan\",Tables!$C$15=\"First Health POS\"),\"\",X37))","v":""},{"$f":"IF(Tables!$B$4=\"WPS\",\"\",IF(AND(Tables!$B$4=\"WPS Health Plan\",Tables!$C$15=\"First Health POS\"),\"\",Y37))","v":""},{"$f":"IF(Tables!$B$4=\"WPS\",\"\",IF(AND(Tables!$B$4=\"WPS Health Plan\",Tables!$C$15=\"First Health POS\"),\"\",Z37))","v":""},{"$f":"IF(Tables!$B$4=\"WPS\",\"\",IF(AND(Tables!$B$4=\"WPS Health Plan\",Tables!$C$15=\"First Health POS\"),\"\",AA37))","v":""},{"$f":"IF(Tables!$B$4=\"WPS\",\"\",IF(AND(Tables!$B$4=\"WPS Health Plan\",Tables!$C$15=\"First Health POS\"),\"\",AB37))","v":""},null,null,null,null,null,null,null,null,null,null,null,null,null,null,null,null,{"$f":"Tables!Y32","v":"WPS PPO Silver $5,500 OOS"},{"$f":"Tables!Z32","v":"81974WI1930047FH"},{"$f":"DOLLAR(Tables!AD32,0)&\"/\"&DOLLAR(Tables!AM32,0)&\" Ded, \"&Tables!AE32&\"/\"&Tables!AN32&\" Coins, \"&DOLLAR(Tables!AF32,0)&\"/\"&DOLLAR(Tables!AO32,0)&\" OOP\"","v":"$5,500/$11,000 Ded, 25%/50% Coins, $9,200/$21,000 OOP"}," ",{"$f":"Tables!AL32","v":750},{"$f":"Tables!AG32","v":0},{"$f":"Tables!AH32","v":10},{"$f":"Tables!AI32","v":50},{"$f":"Tables!AJ32","v":100},0,{"$f":"Tables!AW32","v":"$20 / $40 / $80 / $125 / D/C"},{"$f":"IF(Tables!$B$4=\"WPS Health Plan\",0,ROUND('Rating Formula'!$C$7*Tables!AA32*'Rating Formula'!$C$10,2)*'Rating Formula'!$C$16)","v":{"$error":"#N/A"}}]
[null,{"$f":"IF(Tables!$B$4=\"WPS\",\"\",IF(AND(Tables!$B$4=\"WPS Health Plan\",Tables!$C$15=\"First Health POS\"),\"\",Q38))","v":""},{"$f":"IF(Tables!$B$4=\"WPS\",\"\",IF(AND(Tables!$B$4=\"WPS Health Plan\",Tables!$C$15=\"First Health POS\"),\"\",R38))","v":""},{"$f":"IF(Tables!$B$4=\"WPS\",\"\",IF(AND(Tables!$B$4=\"WPS Health Plan\",Tables!$C$15=\"First Health POS\"),\"\",S38))","v":""},null,{"$f":"IF(Tables!$B$4=\"WPS\",\"\",IF(AND(Tables!$B$4=\"WPS Health Plan\",Tables!$C$15=\"First Health POS\"),\"\",U38))","v":""},{"$f":"IF(Tables!$B$4=\"WPS\",\"\",IF(AND(Tables!$B$4=\"WPS Health Plan\",Tables!$C$15=\"First Health POS\"),\"\",V38))","v":""},{"$f":"IF(Tables!$B$4=\"WPS\",\"\",IF(AND(Tables!$B$4=\"WPS Health Plan\",Tables!$C$15=\"First Health POS\"),\"\",W38))","v":""},{"$f":"IF(Tables!$B$4=\"WPS\",\"\",IF(AND(Tables!$B$4=\"WPS Health Plan\",Tables!$C$15=\"First Health POS\"),\"\",X38))","v":""},{"$f":"IF(Tables!$B$4=\"WPS\",\"\",IF(AND(Tables!$B$4=\"WPS Health Plan\",Tables!$C$15=\"First Health POS\"),\"\",Y38))","v":""},{"$f":"IF(Tables!$B$4=\"WPS\",\"\",IF(AND(Tables!$B$4=\"WPS Health Plan\",Tables!$C$15=\"First Health POS\"),\"\",Z38))","v":""},{"$f":"IF(Tables!$B$4=\"WPS\",\"\",IF(AND(Tables!$B$4=\"WPS Health Plan\",Tables!$C$15=\"First Health POS\"),\"\",AA38))","v":""},{"$f":"IF(Tables!$B$4=\"WPS\",\"\",IF(AND(Tables!$B$4=\"WPS Health Plan\",Tables!$C$15=\"First Health POS\"),\"\",AB38))","v":""},null,null,null,null,null,null,null,null,null,null,null,null,null,null,null,null,{"$f":"Tables!Y33","v":"WPS PPO Silver $5,700 OOS"},{"$f":"Tables!Z33","v":"81974WI1930032FH"},{"$f":"DOLLAR(Tables!AD33,0)&\"/\"&DOLLAR(Tables!AM33,0)&\" Ded, \"&Tables!AE33&\"/\"&Tables!AN33&\" Coins, \"&DOLLAR(Tables!AF33,0)&\"/\"&DOLLAR(Tables!AO33,0)&\" OOP\"","v":"$5,700/$11,400 Ded, 15%/50% Coins, $9,200/$21,400 OOP"}," ",{"$f":"Tables!AL33","v":750},{"$f":"Tables!AG33","v":0},{"$f":"Tables!AH33","v":10},{"$f":"Tables!AI33","v":50},{"$f":"Tables!AJ33","v":100},0,{"$f":"Tables!AW33","v":"$20 / $40 / $80 / $125 / D/C"},{"$f":"IF(Tables!$B$4=\"WPS Health Plan\",0,ROUND('Rating Formula'!$C$7*Tables!AA33*'Rating Formula'!$C$10,2)*'Rating Formula'!$C$16)","v":{"$error":"#N/A"}}]
[null,{"$f":"IF(Tables!$B$4=\"WPS\",\"\",IF(AND(Tables!$B$4=\"WPS Health Plan\",Tables!$C$15=\"First Health POS\"),\"\",Q39))","v":""},{"$f":"IF(Tables!$B$4=\"WPS\",\"\",IF(AND(Tables!$B$4=\"WPS Health Plan\",Tables!$C$15=\"First Health POS\"),\"\",R39))","v":""},{"$f":"IF(Tables!$B$4=\"WPS\",\"\",IF(AND(Tables!$B$4=\"WPS Health Plan\",Tables!$C$15=\"First Health POS\"),\"\",S39))","v":""},null,{"$f":"IF(Tables!$B$4=\"WPS\",\"\",IF(AND(Tables!$B$4=\"WPS Health Plan\",Tables!$C$15=\"First Health POS\"),\"\",U39))","v":""},{"$f":"IF(Tables!$B$4=\"WPS\",\"\",IF(AND(Tables!$B$4=\"WPS Health Plan\",Tables!$C$15=\"First Health POS\"),\"\",V39))","v":""},{"$f":"IF(Tables!$B$4=\"WPS\",\"\",IF(AND(Tables!$B$4=\"WPS Health Plan\",Tables!$C$15=\"First Health POS\"),\"\",W39))","v":""},{"$f":"IF(Tables!$B$4=\"WPS\",\"\",IF(AND(Tables!$B$4=\"WPS Health Plan\",Tables!$C$15=\"First Health POS\"),\"\",X39))","v":""},{"$f":"IF(Tables!$B$4=\"WPS\",\"\",IF(AND(Tables!$B$4=\"WPS Health Plan\",Tables!$C$15=\"First Health POS\"),\"\",Y39))","v":""},{"$f":"IF(Tables!$B$4=\"WPS\",\"\",IF(AND(Tables!$B$4=\"WPS Health Plan\",Tables!$C$15=\"First Health POS\"),\"\",Z39))","v":""},{"$f":"IF(Tables!$B$4=\"WPS\",\"\",IF(AND(Tables!$B$4=\"WPS Health Plan\",Tables!$C$15=\"First Health POS\"),\"\",AA39))","v":""},{"$f":"IF(Tables!$B$4=\"WPS\",\"\",IF(AND(Tables!$B$4=\"WPS Health Plan\",Tables!$C$15=\"First Health POS\"),\"\",AB39))","v":""},null,null,null,null,null,null,null,null,null,null,null,null,null,null,null,null,{"$f":"Tables!Y34","v":"WPS PPO Silver $6,000 OOS"},{"$f":"Tables!Z34","v":"81974WI1930044FH"},{"$f":"DOLLAR(Tables!AD34,0)&\"/\"&DOLLAR(Tables!AM34,0)&\" Ded, \"&Tables!AE34&\"/\"&Tables!AN34&\" Coins, \"&DOLLAR(Tables!AF34,0)&\"/\"&DOLLAR(Tables!AO34,0)&\" OOP\"","v":"$6,000/$12,000 Ded, 25%/50% Coins, $9,000/$22,000 OOP"}," ",{"$f":"Tables!AL34","v":750},{"$f":"Tables!AG34","v":0},{"$f":"Tables!AH34","v":10},{"$f":"Tables!AI34","v":50},{"$f":"Tables!AJ34","v":100},0,{"$f":"Tables!AW34","v":"$20 / $40 / $80 / $125 / D/C"},{"$f":"IF(Tables!$B$4=\"WPS Health Plan\",0,ROUND('Rating Formula'!$C$7*Tables!AA34*'Rating Formula'!$C$10,2)*'Rating Formula'!$C$16)","v":{"$error":"#N/A"}}]
[null,{"$f":"IF(Tables!$B$4=\"WPS\",\"\",IF(AND(Tables!$B$4=\"WPS Health Plan\",Tables!$C$15=\"First Health POS\"),\"\",Q40))","v":""},{"$f":"IF(Tables!$B$4=\"WPS\",\"\",IF(AND(Tables!$B$4=\"WPS Health Plan\",Tables!$C$15=\"First Health POS\"),\"\",R40))","v":""},{"$f":"IF(Tables!$B$4=\"WPS\",\"\",IF(AND(Tables!$B$4=\"WPS Health Plan\",Tables!$C$15=\"First Health POS\"),\"\",S40))","v":""},null,{"$f":"IF(Tables!$B$4=\"WPS\",\"\",IF(AND(Tables!$B$4=\"WPS Health Plan\",Tables!$C$15=\"First Health POS\"),\"\",U40))","v":""},{"$f":"IF(Tables!$B$4=\"WPS\",\"\",IF(AND(Tables!$B$4=\"WPS Health Plan\",Tables!$C$15=\"First Health POS\"),\"\",V40))","v":""},{"$f":"IF(Tables!$B$4=\"WPS\",\"\",IF(AND(Tables!$B$4=\"WPS Health Plan\",Tables!$C$15=\"First Health POS\"),\"\",W40))","v":""},{"$f":"IF(Tables!$B$4=\"WPS\",\"\",IF(AND(Tables!$B$4=\"WPS Health Plan\",Tables!$C$15=\"First Health POS\"),\"\",X40))","v":""},{"$f":"IF(Tables!$B$4=\"WPS\",\"\",IF(AND(Tables!$B$4=\"WPS Health Plan\",Tables!$C$15=\"First Health POS\"),\"\",Y40))","v":""},{"$f":"IF(Tables!$B$4=\"WPS\",\"\",IF(AND(Tables!$B$4=\"WPS Health Plan\",Tables!$C$15=\"First Health POS\"),\"\",Z40))","v":""},{"$f":"IF(Tables!$B$4=\"WPS\",\"\",IF(AND(Tables!$B$4=\"WPS Health Plan\",Tables!$C$15=\"First Health POS\"),\"\",AA40))","v":""},{"$f":"IF(Tables!$B$4=\"WPS\",\"\",IF(AND(Tables!$B$4=\"WPS Health Plan\",Tables!$C$15=\"First Health POS\"),\"\",AB40))","v":""},null,null,null,null,null,null,null,null,null,null,null,null,null,null,null,null,{"$f":"Tables!Y35","v":"WPS PPO Silver $6,500 OOS"},{"$f":"Tables!Z35","v":"81974WI1930048FH"},{"$f":"DOLLAR(Tables!AD35,0)&\"/\"&DOLLAR(Tables!AM35,0)&\" Ded, \"&Tables!AE35&\"/\"&Tables!AN35&\" Coins, \"&DOLLAR(Tables!AF35,0)&\"/\"&DOLLAR(Tables!AO35,0)&\" OOP\"","v":"$6,500/$13,000 Ded, 35%/50% Coins, $9,200/$23,000 OOP"}," ",{"$f":"Tables!AL35","v":750},{"$f":"Tables!AG35","v":0},{"$f":"Tables!AH35","v":10},{"$f":"Tables!AI35","v":50},{"$f":"Tables!AJ35","v":100},0,{"$f":"Tables!AW35","v":"$20 / $40 / $80 / $125 / D/C"},{"$f":"IF(Tables!$B$4=\"WPS Health Plan\",0,ROUND('Rating Formula'!$C$7*Tables!AA35*'Rating Formula'!$C$10,2)*'Rating Formula'!$C$16)","v":{"$error":"#N/A"}}]
[null,{"$f":"IF(Tables!$B$4=\"WPS\",\"\",IF(AND(Tables!$B$4=\"WPS Health Plan\",Tables!$C$15=\"First Health POS\"),\"\",Q41))","v":""},{"$f":"IF(Tables!$B$4=\"WPS\",\"\",IF(AND(Tables!$B$4=\"WPS Health Plan\",Tables!$C$15=\"First Health POS\"),\"\",R41))","v":""},{"$f":"IF(Tables!$B$4=\"WPS\",\"\",IF(AND(Tables!$B$4=\"WPS Health Plan\",Tables!$C$15=\"First Health POS\"),\"\",S41))","v":""},null,{"$f":"IF(Tables!$B$4=\"WPS\",\"\",IF(AND(Tables!$B$4=\"WPS Health Plan\",Tables!$C$15=\"First Health POS\"),\"\",U41))","v":""},{"$f":"IF(Tables!$B$4=\"WPS\",\"\",IF(AND(Tables!$B$4=\"WPS Health Plan\",Tables!$C$15=\"First Health POS\"),\"\",V41))","v":""},{"$f":"IF(Tables!$B$4=\"WPS\",\"\",IF(AND(Tables!$B$4=\"WPS Health Plan\",Tables!$C$15=\"First Health POS\"),\"\",W41))","v":""},{"$f":"IF(Tables!$B$4=\"WPS\",\"\",IF(AND(Tables!$B$4=\"WPS Health Plan\",Tables!$C$15=\"First Health POS\"),\"\",X41))","v":""},{"$f":"IF(Tables!$B$4=\"WPS\",\"\",IF(AND(Tables!$B$4=\"WPS Health Plan\",Tables!$C$15=\"First Health POS\"),\"\",Y41))","v":""},{"$f":"IF(Tables!$B$4=\"WPS\",\"\",IF(AND(Tables!$B$4=\"WPS Health Plan\",Tables!$C$15=\"First Health POS\"),\"\",Z41))","v":""},{"$f":"IF(Tables!$B$4=\"WPS\",\"\",IF(AND(Tables!$B$4=\"WPS Health Plan\",Tables!$C$15=\"First Health POS\"),\"\",AA41))","v":""},{"$f":"IF(Tables!$B$4=\"WPS\",\"\",IF(AND(Tables!$B$4=\"WPS Health Plan\",Tables!$C$15=\"First Health POS\"),\"\",AB41))","v":""},null,null,null,null,null,null,null,null,null,null,null,null,null,null,null,null,{"$f":"Tables!Y36","v":"WPS PPO Silver $9,000 OOS"},{"$f":"Tables!Z36","v":"81974WI1930046FH"},{"$f":"DOLLAR(Tables!AD36,0)&\"/\"&DOLLAR(Tables!AM36,0)&\" Ded, \"&Tables!AE36&\"/\"&Tables!AN36&\" Coins, \"&DOLLAR(Tables!AF36,0)&\"/\"&DOLLAR(Tables!AO36,0)&\" OOP\"","v":"$9,000/$18,000 Ded, 0%/30% Coins, $9,000/$24,000 OOP"}," ",{"$f":"Tables!AL36","v":750},{"$f":"Tables!AG36","v":0},{"$f":"Tables!AH36","v":10},{"$f":"Tables!AI36","v":50},{"$f":"Tables!AJ36","v":100},0,{"$f":"Tables!AW36","v":"$20 / $40 / $80 / $125 / D/C"},{"$f":"IF(Tables!$B$4=\"WPS Health Plan\",0,ROUND('Rating Formula'!$C$7*Tables!AA36*'Rating Formula'!$C$10,2)*'Rating Formula'!$C$16)","v":{"$error":"#N/A"}}]
[null,{"$f":"IF(Tables!$B$4=\"WPS\",\"\",IF(AND(Tables!$B$4=\"WPS Health Plan\",Tables!$C$15=\"First Health POS\"),\"\",Q42))","v":""},{"$f":"IF(Tables!$B$4=\"WPS\",\"\",IF(AND(Tables!$B$4=\"WPS Health Plan\",Tables!$C$15=\"First Health POS\"),\"\",R42))","v":""},{"$f":"IF(Tables!$B$4=\"WPS\",\"\",IF(AND(Tables!$B$4=\"WPS Health Plan\",Tables!$C$15=\"First Health POS\"),\"\",S42))","v":""},{"$f":"IF(Tables!$B$4=\"WPS\",\"\",IF(AND(Tables!$B$4=\"WPS Health Plan\",Tables!$C$15=\"First Health POS\"),\"\",T42))","v":""},{"$f":"IF(Tables!$B$4=\"WPS\",\"\",IF(AND(Tables!$B$4=\"WPS Health Plan\",Tables!$C$15=\"First Health POS\"),\"\",U42))","v":""},{"$f":"IF(Tables!$B$4=\"WPS\",\"\",IF(AND(Tables!$B$4=\"WPS Health Plan\",Tables!$C$15=\"First Health POS\"),\"\",V42))","v":""},{"$f":"IF(Tables!$B$4=\"WPS\",\"\",IF(AND(Tables!$B$4=\"WPS Health Plan\",Tables!$C$15=\"First Health POS\"),\"\",W42))","v":""},{"$f":"IF(Tables!$B$4=\"WPS\",\"\",IF(AND(Tables!$B$4=\"WPS Health Plan\",Tables!$C$15=\"First Health POS\"),\"\",X42))","v":""},{"$f":"IF(Tables!$B$4=\"WPS\",\"\",IF(AND(Tables!$B$4=\"WPS Health Plan\",Tables!$C$15=\"First Health POS\"),\"\",Y42))","v":""},{"$f":"IF(Tables!$B$4=\"WPS\",\"\",IF(AND(Tables!$B$4=\"WPS Health Plan\",Tables!$C$15=\"First Health POS\"),\"\",Z42))","v":""},{"$f":"IF(Tables!$B$4=\"WPS\",\"\",IF(AND(Tables!$B$4=\"WPS Health Plan\",Tables!$C$15=\"First Health POS\"),\"\",AA42))","v":""},{"$f":"IF(Tables!$B$4=\"WPS\",\"\",IF(AND(Tables!$B$4=\"WPS Health Plan\",Tables!$C$15=\"First Health POS\"),\"\",AB42))","v":""},null,null,null,null,null,null,null,null,null,null,null,null,null,null,null,null,{"$f":"Tables!Y37","v":"WPS PPO HDHP Gold $3,000 OOS"},{"$f":"Tables!Z37","v":"81974WI1930022FH"},{"$f":"DOLLAR(Tables!AD37,0)&\"/\"&DOLLAR(Tables!AM37,0)&\" Ded, \"&Tables!AE37&\"/\"&Tables!AN37&\" Coins, \"&DOLLAR(Tables!AF37,0)&\"/\"&DOLLAR(Tables!AO37,0)&\" OOP\"","v":"$3,000/$6,000 Ded, 0%/30% Coins, $3,000/$12,000 OOP"},"Non-Emb",{"$f":"Tables!AL37","v":"D/C"},{"$f":"Tables!AG37","v":"D/C"},{"$f":"Tables!AH37","v":"D/C"},{"$f":"Tables!AI37","v":"D/C"},{"$f":"Tables!AJ37","v":"D/C"},0,{"$f":"Tables!AW37","v":"Plan Deductible, then Coinsurance"},{"$f":"IF(Tables!$B$4=\"WPS Health Plan\",0,ROUND('Rating Formula'!$C$7*Tables!AA37*'Rating Formula'!$C$10,2)*'Rating Formula'!$C$16)","v":{"$error":"#N/A"}}]
[null,{"$f":"IF(Tables!$B$4=\"WPS\",\"\",IF(AND(Tables!$B$4=\"WPS Health Plan\",Tables!$C$15=\"First Health POS\"),\"\",Q43))","v":""},{"$f":"IF(Tables!$B$4=\"WPS\",\"\",IF(AND(Tables!$B$4=\"WPS Health Plan\",Tables!$C$15=\"First Health POS\"),\"\",R43))","v":""},{"$f":"IF(Tables!$B$4=\"WPS\",\"\",IF(AND(Tables!$B$4=\"WPS Health Plan\",Tables!$C$15=\"First Health POS\"),\"\",S43))","v":""},{"$f":"IF(Tables!$B$4=\"WPS\",\"\",IF(AND(Tables!$B$4=\"WPS Health Plan\",Tables!$C$15=\"First Health POS\"),\"\",T43))","v":""},{"$f":"IF(Tables!$B$4=\"WPS\",\"\",IF(AND(Tables!$B$4=\"WPS Health Plan\",Tables!$C$15=\"First Health POS\"),\"\",U43))","v":""},{"$f":"IF(Tables!$B$4=\"WPS\",\"\",IF(AND(Tables!$B$4=\"WPS Health Plan\",Tables!$C$15=\"First Health POS\"),\"\",V43))","v":""},{"$f":"IF(Tables!$B$4=\"WPS\",\"\",IF(AND(Tables!$B$4=\"WPS Health Plan\",Tables!$C$15=\"First Health POS\"),\"\",W43))","v":""},{"$f":"IF(Tables!$B$4=\"WPS\",\"\",IF(AND(Tables!$B$4=\"WPS Health Plan\",Tables!$C$15=\"First Health POS\"),\"\",X43))","v":""},{"$f":"IF(Tables!$B$4=\"WPS\",\"\",IF(AND(Tables!$B$4=\"WPS Health Plan\",Tables!$C$15=\"First Health POS\"),\"\",Y43))","v":""},{"$f":"IF(Tables!$B$4=\"WPS\",\"\",IF(AND(Tables!$B$4=\"WPS Health Plan\",Tables!$C$15=\"First Health POS\"),\"\",Z43))","v":""},{"$f":"IF(Tables!$B$4=\"WPS\",\"\",IF(AND(Tables!$B$4=\"WPS Health Plan\",Tables!$C$15=\"First Health POS\"),\"\",AA43))","v":""},{"$f":"IF(Tables!$B$4=\"WPS\",\"\",IF(AND(Tables!$B$4=\"WPS Health Plan\",Tables!$C$15=\"First Health POS\"),\"\",AB43))","v":""},null,null,null,null,null,null,null,null,null,null,null,null,null,null,null,null,{"$f":"Tables!Y38","v":"WPS PPO HDHP Gold $3,750 OOS"},{"$f":"Tables!Z38","v":"81974WI1930049FH"},{"$f":"DOLLAR(Tables!AD38,0)&\"/\"&DOLLAR(Tables!AM38,0)&\" Ded, \"&Tables!AE38&\"/\"&Tables!AN38&\" Coins, \"&DOLLAR(Tables!AF38,0)&\"/\"&DOLLAR(Tables!AO38,0)&\" OOP\"","v":"$3,750/$7,500 Ded, 0%/30% Coins, $3,750/$13,500 OOP"},"Embedded",{"$f":"Tables!AL38","v":"D/C"},{"$f":"Tables!AG38","v":"D/C"},{"$f":"Tables!AH38","v":"D/C"},{"$f":"Tables!AI38","v":"D/C"},{"$f":"Tables!AJ38","v":"D/C"},0,{"$f":"Tables!AW38","v":"Plan Deductible, then Coinsurance"},{"$f":"IF(Tables!$B$4=\"WPS Health Plan\",0,ROUND('Rating Formula'!$C$7*Tables!AA38*'Rating Formula'!$C$10,2)*'Rating Formula'!$C$16)","v":{"$error":"#N/A"}}]
[null,{"$f":"IF(Tables!$B$4=\"WPS\",\"\",IF(AND(Tables!$B$4=\"WPS Health Plan\",Tables!$C$15=\"First Health POS\"),\"\",Q44))","v":""},{"$f":"IF(Tables!$B$4=\"WPS\",\"\",IF(AND(Tables!$B$4=\"WPS Health Plan\",Tables!$C$15=\"First Health POS\"),\"\",R44))","v":""},{"$f":"IF(Tables!$B$4=\"WPS\",\"\",IF(AND(Tables!$B$4=\"WPS Health Plan\",Tables!$C$15=\"First Health POS\"),\"\",S44))","v":""},{"$f":"IF(Tables!$B$4=\"WPS\",\"\",IF(AND(Tables!$B$4=\"WPS Health Plan\",Tables!$C$15=\"First Health POS\"),\"\",T44))","v":""},{"$f":"IF(Tables!$B$4=\"WPS\",\"\",IF(AND(Tables!$B$4=\"WPS Health Plan\",Tables!$C$15=\"First Health POS\"),\"\",U44))","v":""},{"$f":"IF(Tables!$B$4=\"WPS\",\"\",IF(AND(Tables!$B$4=\"WPS Health Plan\",Tables!$C$15=\"First Health POS\"),\"\",V44))","v":""},{"$f":"IF(Tables!$B$4=\"WPS\",\"\",IF(AND(Tables!$B$4=\"WPS Health Plan\",Tables!$C$15=\"First Health POS\"),\"\",W44))","v":""},{"$f":"IF(Tables!$B$4=\"WPS\",\"\",IF(AND(Tables!$B$4=\"WPS Health Plan\",Tables!$C$15=\"First Health POS\"),\"\",X44))","v":""},{"$f":"IF(Tables!$B$4=\"WPS\",\"\",IF(AND(Tables!$B$4=\"WPS Health Plan\",Tables!$C$15=\"First Health POS\"),\"\",Y44))","v":""},{"$f":"IF(Tables!$B$4=\"WPS\",\"\",IF(AND(Tables!$B$4=\"WPS Health Plan\",Tables!$C$15=\"First Health POS\"),\"\",Z44))","v":""},{"$f":"IF(Tables!$B$4=\"WPS\",\"\",IF(AND(Tables!$B$4=\"WPS Health Plan\",Tables!$C$15=\"First Health POS\"),\"\",AA44))","v":""},{"$f":"IF(Tables!$B$4=\"WPS\",\"\",IF(AND(Tables!$B$4=\"WPS Health Plan\",Tables!$C$15=\"First Health POS\"),\"\",AB44))","v":""},null,null,null,null,null,null,null,null,null,null,null,null,null,null,null,null,{"$f":"Tables!Y39","v":"WPS PPO HDHP Silver $2,500 OOS"},{"$f":"Tables!Z39","v":"81974WI1930023FH"},{"$f":"DOLLAR(Tables!AD39,0)&\"/\"&DOLLAR(Tables!AM39,0)&\" Ded, \"&Tables!AE39&\"/\"&Tables!AN39&\" Coins, \"&DOLLAR(Tables!AF39,0)&\"/\"&DOLLAR(Tables!AO39,0)&\" OOP\"","v":"$2,500/$5,000 Ded, 30%/50% Coins, $8,000/$15,000 OOP"},"Non-Emb",{"$f":"Tables!AL39","v":"D/C"},{"$f":"Tables!AG39","v":"D/C"},{"$f":"Tables!AH39","v":"D/C"},{"$f":"Tables!AI39","v":"D/C"},{"$f":"Tables!AJ39","v":"D/C"},0,{"$f":"Tables!AW39","v":"Plan Deductible, then Coinsurance"},{"$f":"IF(Tables!$B$4=\"WPS Health Plan\",0,ROUND('Rating Formula'!$C$7*Tables!AA39*'Rating Formula'!$C$10,2)*'Rating Formula'!$C$16)","v":{"$error":"#N/A"}}]
[null,{"$f":"IF(Tables!$B$4=\"WPS\",\"\",IF(AND(Tables!$B$4=\"WPS Health Plan\",Tables!$C$15=\"First Health POS\"),\"\",Q45))","v":""},{"$f":"IF(Tables!$B$4=\"WPS\",\"\",IF(AND(Tables!$B$4=\"WPS Health Plan\",Tables!$C$15=\"First Health POS\"),\"\",R45))","v":""},{"$f":"IF(Tables!$B$4=\"WPS\",\"\",IF(AND(Tables!$B$4=\"WPS Health Plan\",Tables!$C$15=\"First Health POS\"),\"\",S45))","v":""},{"$f":"IF(Tables!$B$4=\"WPS\",\"\",IF(AND(Tables!$B$4=\"WPS Health Plan\",Tables!$C$15=\"First Health POS\"),\"\",T45))","v":""},{"$f":"IF(Tables!$B$4=\"WPS\",\"\",IF(AND(Tables!$B$4=\"WPS Health Plan\",Tables!$C$15=\"First Health POS\"),\"\",U45))","v":""},{"$f":"IF(Tables!$B$4=\"WPS\",\"\",IF(AND(Tables!$B$4=\"WPS Health Plan\",Tables!$C$15=\"First Health POS\"),\"\",V45))","v":""},{"$f":"IF(Tables!$B$4=\"WPS\",\"\",IF(AND(Tables!$B$4=\"WPS Health Plan\",Tables!$C$15=\"First Health POS\"),\"\",W45))","v":""},{"$f":"IF(Tables!$B$4=\"WPS\",\"\",IF(AND(Tables!$B$4=\"WPS Health Plan\",Tables!$C$15=\"First Health POS\"),\"\",X45))","v":""},{"$f":"IF(Tables!$B$4=\"WPS\",\"\",IF(AND(Tables!$B$4=\"WPS Health Plan\",Tables!$C$15=\"First Health POS\"),\"\",Y45))","v":""},{"$f":"IF(Tables!$B$4=\"WPS\",\"\",IF(AND(Tables!$B$4=\"WPS Health Plan\",Tables!$C$15=\"First Health POS\"),\"\",Z45))","v":""},{"$f":"IF(Tables!$B$4=\"WPS\",\"\",IF(AND(Tables!$B$4=\"WPS Health Plan\",Tables!$C$15=\"First Health POS\"),\"\",AA45))","v":""},{"$f":"IF(Tables!$B$4=\"WPS\",\"\",IF(AND(Tables!$B$4=\"WPS Health Plan\",Tables!$C$15=\"First Health POS\"),\"\",AB45))","v":""},null,null,null,null,null,null,null,null,null,null,null,null,null,null,null,null,{"$f":"Tables!Y40","v":"WPS PPO HDHP Silver $3,300 OOS"},{"$f":"Tables!Z40","v":"81974WI1930035FH"},{"$f":"DOLLAR(Tables!AD40,0)&\"/\"&DOLLAR(Tables!AM40,0)&\" Ded, \"&Tables!AE40&\"/\"&Tables!AN40&\" Coins, \"&DOLLAR(Tables!AF40,0)&\"/\"&DOLLAR(Tables!AO40,0)&\" OOP\"","v":"$3,300/$6,600 Ded, 20%/50% Coins, $8,300/$16,600 OOP"},"Embedded",{"$f":"Tables!AL40","v":"D/C"},{"$f":"Tables!AG40","v":"D/C"},{"$f":"Tables!AH40","v":"D/C"},{"$f":"Tables!AI40","v":"D/C"},{"$f":"Tables!AJ40","v":"D/C"},0,{"$f":"Tables!AW40","v":"Plan Deductible, then Coinsurance"},{"$f":"IF(Tables!$B$4=\"WPS Health Plan\",0,ROUND('Rating Formula'!$C$7*Tables!AA40*'Rating Formula'!$C$10,2)*'Rating Formula'!$C$16)","v":{"$error":"#N/A"}}]
[null,{"$f":"IF(Tables!$B$4=\"WPS\",\"\",IF(AND(Tables!$B$4=\"WPS Health Plan\",Tables!$C$15=\"First Health POS\"),\"\",Q46))","v":""},{"$f":"IF(Tables!$B$4=\"WPS\",\"\",IF(AND(Tables!$B$4=\"WPS Health Plan\",Tables!$C$15=\"First Health POS\"),\"\",R46))","v":""},{"$f":"IF(Tables!$B$4=\"WPS\",\"\",IF(AND(Tables!$B$4=\"WPS Health Plan\",Tables!$C$15=\"First Health POS\"),\"\",S46))","v":""},{"$f":"IF(Tables!$B$4=\"WPS\",\"\",IF(AND(Tables!$B$4=\"WPS Health Plan\",Tables!$C$15=\"First Health POS\"),\"\",T46))","v":""},{"$f":"IF(Tables!$B$4=\"WPS\",\"\",IF(AND(Tables!$B$4=\"WPS Health Plan\",Tables!$C$15=\"First Health POS\"),\"\",U46))","v":""},{"$f":"IF(Tables!$B$4=\"WPS\",\"\",IF(AND(Tables!$B$4=\"WPS Health Plan\",Tables!$C$15=\"First Health POS\"),\"\",V46))","v":""},{"$f":"IF(Tables!$B$4=\"WPS\",\"\",IF(AND(Tables!$B$4=\"WPS Health Plan\",Tables!$C$15=\"First Health POS\"),\"\",W46))","v":""},{"$f":"IF(Tables!$B$4=\"WPS\",\"\",IF(AND(Tables!$B$4=\"WPS Health Plan\",Tables!$C$15=\"First Health POS\"),\"\",X46))","v":""},{"$f":"IF(Tables!$B$4=\"WPS\",\"\",IF(AND(Tables!$B$4=\"WPS Health Plan\",Tables!$C$15=\"First Health POS\"),\"\",Y46))","v":""},{"$f":"IF(Tables!$B$4=\"WPS\",\"\",IF(AND(Tables!$B$4=\"WPS Health Plan\",Tables!$C$15=\"First Health POS\"),\"\",Z46))","v":""},{"$f":"IF(Tables!$B$4=\"WPS\",\"\",IF(AND(Tables!$B$4=\"WPS Health Plan\",Tables!$C$15=\"First Health POS\"),\"\",AA46))","v":""},{"$f":"IF(Tables!$B$4=\"WPS\",\"\",IF(AND(Tables!$B$4=\"WPS Health Plan\",Tables!$C$15=\"First Health POS\"),\"\",AB46))","v":""},null,null,null,null,null,null,null,null,null,null,null,null,null,null,null,null,{"$f":"Tables!Y41","v":"WPS PPO HDHP Silver $3,500 OOS"},{"$f":"Tables!Z41","v":"81974WI1930050FH"},{"$f":"DOLLAR(Tables!AD41,0)&\"/\"&DOLLAR(Tables!AM41,0)&\" Ded, \"&Tables!AE41&\"/\"&Tables!AN41&\" Coins, \"&DOLLAR(Tables!AF41,0)&\"/\"&DOLLAR(Tables!AO41,0)&\" OOP\"","v":"$3,500/$7,000 Ded, 20%/50% Coins, $8,300/$17,000 OOP"},"Embedded",{"$f":"Tables!AL41","v":"D/C"},{"$f":"Tables!AG41","v":"D/C"},{"$f":"Tables!AH41","v":"D/C"},{"$f":"Tables!AI41","v":"D/C"},{"$f":"Tables!AJ41","v":"D/C"},0,{"$f":"Tables!AW41","v":"Plan Deductible, then Coinsurance"},{"$f":"IF(Tables!$B$4=\"WPS Health Plan\",0,ROUND('Rating Formula'!$C$7*Tables!AA41*'Rating Formula'!$C$10,2)*'Rating Formula'!$C$16)","v":{"$error":"#N/A"}}]
[null,{"$f":"IF(Tables!$B$4=\"WPS\",\"\",IF(AND(Tables!$B$4=\"WPS Health Plan\",Tables!$C$15=\"First Health POS\"),\"\",Q47))","v":""},{"$f":"IF(Tables!$B$4=\"WPS\",\"\",IF(AND(Tables!$B$4=\"WPS Health Plan\",Tables!$C$15=\"First Health POS\"),\"\",R47))","v":""},{"$f":"IF(Tables!$B$4=\"WPS\",\"\",IF(AND(Tables!$B$4=\"WPS Health Plan\",Tables!$C$15=\"First Health POS\"),\"\",S47))","v":""},{"$f":"IF(Tables!$B$4=\"WPS\",\"\",IF(AND(Tables!$B$4=\"WPS Health Plan\",Tables!$C$15=\"First Health POS\"),\"\",T47))","v":""},{"$f":"IF(Tables!$B$4=\"WPS\",\"\",IF(AND(Tables!$B$4=\"WPS Health Plan\",Tables!$C$15=\"First Health POS\"),\"\",U47))","v":""},{"$f":"IF(Tables!$B$4=\"WPS\",\"\",IF(AND(Tables!$B$4=\"WPS Health Plan\",Tables!$C$15=\"First Health POS\"),\"\",V47))","v":""},{"$f":"IF(Tables!$B$4=\"WPS\",\"\",IF(AND(Tables!$B$4=\"WPS Health Plan\",Tables!$C$15=\"First Health POS\"),\"\",W47))","v":""},{"$f":"IF(Tables!$B$4=\"WPS\",\"\",IF(AND(Tables!$B$4=\"WPS Health Plan\",Tables!$C$15=\"First Health POS\"),\"\",X47))","v":""},{"$f":"IF(Tables!$B$4=\"WPS\",\"\",IF(AND(Tables!$B$4=\"WPS Health Plan\",Tables!$C$15=\"First Health POS\"),\"\",Y47))","v":""},{"$f":"IF(Tables!$B$4=\"WPS\",\"\",IF(AND(Tables!$B$4=\"WPS Health Plan\",Tables!$C$15=\"First Health POS\"),\"\",Z47))","v":""},{"$f":"IF(Tables!$B$4=\"WPS\",\"\",IF(AND(Tables!$B$4=\"WPS Health Plan\",Tables!$C$15=\"First Health POS\"),\"\",AA47))","v":""},{"$f":"IF(Tables!$B$4=\"WPS\",\"\",IF(AND(Tables!$B$4=\"WPS Health Plan\",Tables!$C$15=\"First Health POS\"),\"\",AB47))","v":""},null,null,null,null,null,null,null,null,null,null,null,null,null,null,null,null,{"$f":"Tables!Y42","v":"WPS PPO HDHP Silver $4,000 OOS"},{"$f":"Tables!Z42","v":"81974WI1930025FH"},{"$f":"DOLLAR(Tables!AD42,0)&\"/\"&DOLLAR(Tables!AM42,0)&\" Ded, \"&Tables!AE42&\"/\"&Tables!AN42&\" Coins, \"&DOLLAR(Tables!AF42,0)&\"/\"&DOLLAR(Tables!AO42,0)&\" OOP\"","v":"$4,000/$8,000 Ded, 30%/50% Coins, $7,500/$18,000 OOP"},"Embedded",{"$f":"Tables!AL42","v":"D/C"},{"$f":"Tables!AG42","v":"D/C"},{"$f":"Tables!AH42","v":"D/C"},{"$f":"Tables!AI42","v":"D/C"},{"$f":"Tables!AJ42","v":"D/C"},0,{"$f":"Tables!AW42","v":"Plan Deductible, then Coinsurance"},{"$f":"IF(Tables!$B$4=\"WPS Health Plan\",0,ROUND('Rating Formula'!$C$7*Tables!AA42*'Rating Formula'!$C$10,2)*'Rating Formula'!$C$16)","v":{"$error":"#N/A"}}]
[null,{"$f":"IF(Tables!$B$4=\"WPS\",\"\",IF(AND(Tables!$B$4=\"WPS Health Plan\",Tables!$C$15=\"First Health POS\"),\"\",Q48))","v":""},{"$f":"IF(Tables!$B$4=\"WPS\",\"\",IF(AND(Tables!$B$4=\"WPS Health Plan\",Tables!$C$15=\"First Health POS\"),\"\",R48))","v":""},{"$f":"IF(Tables!$B$4=\"WPS\",\"\",IF(AND(Tables!$B$4=\"WPS Health Plan\",Tables!$C$15=\"First Health POS\"),\"\",S48))","v":""},{"$f":"IF(Tables!$B$4=\"WPS\",\"\",IF(AND(Tables!$B$4=\"WPS Health Plan\",Tables!$C$15=\"First Health POS\"),\"\",T48))","v":""},{"$f":"IF(Tables!$B$4=\"WPS\",\"\",IF(AND(Tables!$B$4=\"WPS Health Plan\",Tables!$C$15=\"First Health POS\"),\"\",U48))","v":""},{"$f":"IF(Tables!$B$4=\"WPS\",\"\",IF(AND(Tables!$B$4=\"WPS Health Plan\",Tables!$C$15=\"First Health POS\"),\"\",V48))","v":""},{"$f":"IF(Tables!$B$4=\"WPS\",\"\",IF(AND(Tables!$B$4=\"WPS Health Plan\",Tables!$C$15=\"First Health POS\"),\"\",W48))","v":""},{"$f":"IF(Tables!$B$4=\"WPS\",\"\",IF(AND(Tables!$B$4=\"WPS Health Plan\",Tables!$C$15=\"First Health POS\"),\"\",X48))","v":""},{"$f":"IF(Tables!$B$4=\"WPS\",\"\",IF(AND(Tables!$B$4=\"WPS Health Plan\",Tables!$C$15=\"First Health POS\"),\"\",Y48))","v":""},{"$f":"IF(Tables!$B$4=\"WPS\",\"\",IF(AND(Tables!$B$4=\"WPS Health Plan\",Tables!$C$15=\"First Health POS\"),\"\",Z48))","v":""},{"$f":"IF(Tables!$B$4=\"WPS\",\"\",IF(AND(Tables!$B$4=\"WPS Health Plan\",Tables!$C$15=\"First Health POS\"),\"\",AA48))","v":""},{"$f":"IF(Tables!$B$4=\"WPS\",\"\",IF(AND(Tables!$B$4=\"WPS Health Plan\",Tables!$C$15=\"First Health POS\"),\"\",AB48))","v":""},null,null,null,null,null,null,null,null,null,null,null,null,null,null,null,null,{"$f":"Tables!Y43","v":"WPS PPO HDHP Silver $5,100 OOS"},{"$f":"Tables!Z43","v":"81974WI1930037FH"},{"$f":"DOLLAR(Tables!AD43,0)&\"/\"&DOLLAR(Tables!AM43,0)&\" Ded, \"&Tables!AE43&\"/\"&Tables!AN43&\" Coins, \"&DOLLAR(Tables!AF43,0)&\"/\"&DOLLAR(Tables!AO43,0)&\" OOP\"","v":"$5,100/$10,200 Ded, 0%/30% Coins, $5,100/$16,200 OOP"},"Embedded",{"$f":"Tables!AL43","v":"D/C"},{"$f":"Tables!AG43","v":"D/C"},{"$f":"Tables!AH43","v":"D/C"},{"$f":"Tables!AI43","v":"D/C"},{"$f":"Tables!AJ43","v":"D/C"},0,{"$f":"Tables!AW43","v":"Plan Deductible, then Coinsurance"},{"$f":"IF(Tables!$B$4=\"WPS Health Plan\",0,ROUND('Rating Formula'!$C$7*Tables!AA43*'Rating Formula'!$C$10,2)*'Rating Formula'!$C$16)","v":{"$error":"#N/A"}}]
[null,{"$f":"IF(Tables!$B$4=\"WPS\",\"\",IF(AND(Tables!$B$4=\"WPS Health Plan\",Tables!$C$15=\"First Health POS\"),\"\",Q49))","v":""},{"$f":"IF(Tables!$B$4=\"WPS\",\"\",IF(AND(Tables!$B$4=\"WPS Health Plan\",Tables!$C$15=\"First Health POS\"),\"\",R49))","v":""},{"$f":"IF(Tables!$B$4=\"WPS\",\"\",IF(AND(Tables!$B$4=\"WPS Health Plan\",Tables!$C$15=\"First Health POS\"),\"\",S49))","v":""},{"$f":"IF(Tables!$B$4=\"WPS\",\"\",IF(AND(Tables!$B$4=\"WPS Health Plan\",Tables!$C$15=\"First Health POS\"),\"\",T49))","v":""},{"$f":"IF(Tables!$B$4=\"WPS\",\"\",IF(AND(Tables!$B$4=\"WPS Health Plan\",Tables!$C$15=\"First Health POS\"),\"\",U49))","v":""},{"$f":"IF(Tables!$B$4=\"WPS\",\"\",IF(AND(Tables!$B$4=\"WPS Health Plan\",Tables!$C$15=\"First Health POS\"),\"\",V49))","v":""},{"$f":"IF(Tables!$B$4=\"WPS\",\"\",IF(AND(Tables!$B$4=\"WPS Health Plan\",Tables!$C$15=\"First Health POS\"),\"\",W49))","v":""},{"$f":"IF(Tables!$B$4=\"WPS\",\"\",IF(AND(Tables!$B$4=\"WPS Health Plan\",Tables!$C$15=\"First Health POS\"),\"\",X49))","v":""},{"$f":"IF(Tables!$B$4=\"WPS\",\"\",IF(AND(Tables!$B$4=\"WPS Health Plan\",Tables!$C$15=\"First Health POS\"),\"\",Y49))","v":""},{"$f":"IF(Tables!$B$4=\"WPS\",\"\",IF(AND(Tables!$B$4=\"WPS Health Plan\",Tables!$C$15=\"First Health POS\"),\"\",Z49))","v":""},{"$f":"IF(Tables!$B$4=\"WPS\",\"\",IF(AND(Tables!$B$4=\"WPS Health Plan\",Tables!$C$15=\"First Health POS\"),\"\",AA49))","v":""},{"$f":"IF(Tables!$B$4=\"WPS\",\"\",IF(AND(Tables!$B$4=\"WPS Health Plan\",Tables!$C$15=\"First Health POS\"),\"\",AB49))","v":""},null,null,null,null,null,null,null,null,null,null,null,null,null,null,null,null,{"$f":"Tables!Y44","v":"WPS PPO HDHP Silver $6,000 OOS"},{"$f":"Tables!Z44","v":"81974WI1930051FH"},{"$f":"DOLLAR(Tables!AD44,0)&\"/\"&DOLLAR(Tables!AM44,0)&\" Ded, \"&Tables!AE44&\"/\"&Tables!AN44&\" Coins, \"&DOLLAR(Tables!AF44,0)&\"/\"&DOLLAR(Tables!AO44,0)&\" OOP\"","v":"$6,000/$12,000 Ded, 0%/30% Coins, $6,000/$18,000 OOP"},"Embedded",{"$f":"Tables!AL44","v":"D/C"},{"$f":"Tables!AG44","v":"D/C"},{"$f":"Tables!AH44","v":"D/C"},{"$f":"Tables!AI44","v":"D/C"},{"$f":"Tables!AJ44","v":"D/C"},0,{"$f":"Tables!AW44","v":"Plan Deductible, then Coinsurance"},{"$f":"IF(Tables!$B$4=\"WPS Health Plan\",0,ROUND('Rating Formula'!$C$7*Tables!AA44*'Rating Formula'!$C$10,2)*'Rating Formula'!$C$16)","v":{"$error":"#N/A"}}]
[null,{"$f":"IF(Tables!$B$4=\"WPS\",\"\",IF(AND(Tables!$B$4=\"WPS Health Plan\",Tables!$C$15=\"First Health POS\"),\"\",Q50))","v":""},{"$f":"IF(Tables!$B$4=\"WPS\",\"\",IF(AND(Tables!$B$4=\"WPS Health Plan\",Tables!$C$15=\"First Health POS\"),\"\",R50))","v":""},{"$f":"IF(Tables!$B$4=\"WPS\",\"\",IF(AND(Tables!$B$4=\"WPS Health Plan\",Tables!$C$15=\"First Health POS\"),\"\",S50))","v":""},{"$f":"IF(Tables!$B$4=\"WPS\",\"\",IF(AND(Tables!$B$4=\"WPS Health Plan\",Tables!$C$15=\"First Health POS\"),\"\",T50))","v":""},{"$f":"IF(Tables!$B$4=\"WPS\",\"\",IF(AND(Tables!$B$4=\"WPS Health Plan\",Tables!$C$15=\"First Health POS\"),\"\",U50))","v":""},{"$f":"IF(Tables!$B$4=\"WPS\",\"\",IF(AND(Tables!$B$4=\"WPS Health Plan\",Tables!$C$15=\"First Health POS\"),\"\",V50))","v":""},{"$f":"IF(Tables!$B$4=\"WPS\",\"\",IF(AND(Tables!$B$4=\"WPS Health Plan\",Tables!$C$15=\"First Health POS\"),\"\",W50))","v":""},{"$f":"IF(Tables!$B$4=\"WPS\",\"\",IF(AND(Tables!$B$4=\"WPS Health Plan\",Tables!$C$15=\"First Health POS\"),\"\",X50))","v":""},{"$f":"IF(Tables!$B$4=\"WPS\",\"\",IF(AND(Tables!$B$4=\"WPS Health Plan\",Tables!$C$15=\"First Health POS\"),\"\",Y50))","v":""},{"$f":"IF(Tables!$B$4=\"WPS\",\"\",IF(AND(Tables!$B$4=\"WPS Health Plan\",Tables!$C$15=\"First Health POS\"),\"\",Z50))","v":""},{"$f":"IF(Tables!$B$4=\"WPS\",\"\",IF(AND(Tables!$B$4=\"WPS Health Plan\",Tables!$C$15=\"First Health POS\"),\"\",AA50))","v":""},{"$f":"IF(Tables!$B$4=\"WPS\",\"\",IF(AND(Tables!$B$4=\"WPS Health Plan\",Tables!$C$15=\"First Health POS\"),\"\",AB50))","v":""},null,null,null,null,null,null,null,null,null,null,null,null,null,null,null,null,{"$f":"Tables!Y45","v":"WPS PPO HDHP Bronze $6,500 OOS"},{"$f":"Tables!Z45","v":"81974WI1930027FH"},{"$f":"DOLLAR(Tables!AD45,0)&\"/\"&DOLLAR(Tables!AM45,0)&\" Ded, \"&Tables!AE45&\"/\"&Tables!AN45&\" Coins, \"&DOLLAR(Tables!AF45,0)&\"/\"&DOLLAR(Tables!AO45,0)&\" OOP\"","v":"$6,500/$13,000 Ded, 30%/50% Coins, $8,300/$23,000 OOP"},"Embedded",{"$f":"Tables!AL45","v":"D/C"},{"$f":"Tables!AG45","v":"D/C"},{"$f":"Tables!AH45","v":"D/C"},{"$f":"Tables!AI45","v":"D/C"},{"$f":"Tables!AJ45","v":"D/C"},0,{"$f":"Tables!AW45","v":"Plan Deductible, then Coinsurance"},{"$f":"IF(Tables!$B$4=\"WPS Health Plan\",0,ROUND('Rating Formula'!$C$7*Tables!AA45*'Rating Formula'!$C$10,2)*'Rating Formula'!$C$16)","v":{"$error":"#N/A"}}]
[null,{"$f":"IF(Tables!$B$4=\"WPS\",\"\",IF(AND(Tables!$B$4=\"WPS Health Plan\",Tables!$C$15=\"First Health POS\"),\"\",Q51))","v":""},{"$f":"IF(Tables!$B$4=\"WPS\",\"\",IF(AND(Tables!$B$4=\"WPS Health Plan\",Tables!$C$15=\"First Health POS\"),\"\",R51))","v":""},{"$f":"IF(Tables!$B$4=\"WPS\",\"\",IF(AND(Tables!$B$4=\"WPS Health Plan\",Tables!$C$15=\"First Health POS\"),\"\",S51))","v":""},{"$f":"IF(Tables!$B$4=\"WPS\",\"\",IF(AND(Tables!$B$4=\"WPS Health Plan\",Tables!$C$15=\"First Health POS\"),\"\",T51))","v":""},{"$f":"IF(Tables!$B$4=\"WPS\",\"\",IF(AND(Tables!$B$4=\"WPS Health Plan\",Tables!$C$15=\"First Health POS\"),\"\",U51))","v":""},{"$f":"IF(Tables!$B$4=\"WPS\",\"\",IF(AND(Tables!$B$4=\"WPS Health Plan\",Tables!$C$15=\"First Health POS\"),\"\",V51))","v":""},{"$f":"IF(Tables!$B$4=\"WPS\",\"\",IF(AND(Tables!$B$4=\"WPS Health Plan\",Tables!$C$15=\"First Health POS\"),\"\",W51))","v":""},{"$f":"IF(Tables!$B$4=\"WPS\",\"\",IF(AND(Tables!$B$4=\"WPS Health Plan\",Tables!$C$15=\"First Health POS\"),\"\",X51))","v":""},{"$f":"IF(Tables!$B$4=\"WPS\",\"\",IF(AND(Tables!$B$4=\"WPS Health Plan\",Tables!$C$15=\"First Health POS\"),\"\",Y51))","v":""},{"$f":"IF(Tables!$B$4=\"WPS\",\"\",IF(AND(Tables!$B$4=\"WPS Health Plan\",Tables!$C$15=\"First Health POS\"),\"\",Z51))","v":""},{"$f":"IF(Tables!$B$4=\"WPS\",\"\",IF(AND(Tables!$B$4=\"WPS Health Plan\",Tables!$C$15=\"First Health POS\"),\"\",AA51))","v":""},{"$f":"IF(Tables!$B$4=\"WPS\",\"\",IF(AND(Tables!$B$4=\"WPS Health Plan\",Tables!$C$15=\"First Health POS\"),\"\",AB51))","v":""},null,null,null,null,null,null,null,null,null,null,null,null,null,null,null,null,{"$f":"Tables!Y46","v":"WPS PPO HDHP Bronze $8,300 OOS"},{"$f":"Tables!Z46","v":"81974WI1930026FH"},{"$f":"DOLLAR(Tables!AD46,0)&\"/\"&DOLLAR(Tables!AM46,0)&\" Ded, \"&Tables!AE46&\"/\"&Tables!AN46&\" Coins, \"&DOLLAR(Tables!AF46,0)&\"/\"&DOLLAR(Tables!AO46,0)&\" OOP\"","v":"$8,300/$16,600 Ded, 0%/30% Coins, $8,300/$22,600 OOP"},"Embedded",{"$f":"Tables!AL46","v":"D/C"},{"$f":"Tables!AG46","v":"D/C"},{"$f":"Tables!AH46","v":"D/C"},{"$f":"Tables!AI46","v":"D/C"},{"$f":"Tables!AJ46","v":"D/C"},0,{"$f":"Tables!AW46","v":"Plan Deductible, then Coinsurance"},{"$f":"IF(Tables!$B$4=\"WPS Health Plan\",0,ROUND('Rating Formula'!$C$7*Tables!AA46*'Rating Formula'!$C$10,2)*'Rating Formula'!$C$16)","v":{"$error":"#N/A"}}]
[]
[]
[]
[null,"Signature________________________________________Title______________________________Date_______________"]
[]
[null,"* Please note that your actual enrolled premium rate may vary slightly from the premium rates shown on this page."]

{"sheet":"Changes","index":5,"n_rows":36,"n_cols":11,"rows_kept":36,"cut":false,"hidden":true,"merged":[]}
[]
[null,2020]
[null,"TEST","chaged tab names to get rid of special characters (Output - Renewal, Base Rate & Expenses, Age & Tobacco, and Area & Network"]
[null,null,"created new Input tab using data validation"]
[null,null,"removed tabs:"]
[null,null,null,"Area and Network"]
[null,null,null,"Age and Tobacco"]
[null,null,null,"Arise Benefit",null,null,null,null,null,null,"to HIDE:"]
[null,null,null,"WPS Benefit",null,null,null,null,null,null,"Hide all tabs to the right of Alternates tab"]
[null,null,null,"Benefit Reads",null,null,null,null,null,null,"Hide col Z - AX on Input tab"]
[null,null,"put all above info in Tables tab",null,null,null,null,null,null,null,"Hide col L on Group Rate Summary tab"]
[null,null,"removed merged fields from tabs that have those cols hidden",null,null,null,null,null,null,null,"Hide col Q - AO on Alternates tab"]
[null,null,"removed preventive care from drug lines",null,null,null,null,null,null,null,"\"Protect Sheet\" on \"File\" tab for remaining visible sheets"]
[null,null,"adjusted colors on Input tab",null,null,null,null,null,null,null,"\"Protect Workbook\" on \"File\" tab"]
[null,null,"added conditional formatting to Member Type col on Input tab",null,null,null,null,null,null,null,"Lock VBA code on Tools menu from IDE"]
[null,null,"took network factor out of rating formula (now included in BenFact)"]
[null,null,"added macro to control focus when user is entering rating data"]
[null,null,"added macro to clear user entered fields below any change made that impacts rating"]
[null,null,"updated LOCK DOWN  macro to prevent users from accessing locked cells"]
[null,null,"fixed the order Arise plans were showing up on Alternates tab"]
[null,null,"updated Agent Resources tab from Matt"]
[null,"TEST2","added blue & bold font for current plan on Alternates tab"]
[null,null,"centered Region field on Input tab"]
[null,null,"updated WPS SBC URLs on Input tab"]
[null,null,"unprotect cols AH6:AL195 on Input tab so rating macro runs ok"]
[null,null,"save Group Name, Agency Name, Effective Date, & Group County when switching"]
[null,null,null,"between companies on Input tab - CoChangeClear macro"]
[null,null,"added ClearData macro for Clear Data button on Input tab"]
[null,"v1","altered cell properties so hyperlinks work when Input tab is protected"]
[null,null,null,"L13, F38, K38, I41"]
[null,null,"updated WPS URL"]
[null,null,"fixed Alternates tab so correct plans appear"]
[null,null,"added more specific instructions to data validation on Input tab"]
[null,null,"added more conditional formatting to Member Type & DOB cols on Input tab"]
[null,null,"added WPS/Arise to Census Entry title"]
[null,null,"added Link Library from Matt 8-24-2018"]

{"sheet":"Tables","index":6,"n_rows":109,"n_cols":78,"rows_kept":109,"cut":false,"hidden":true,"merged":[[2,29,2,31],[2,32,2,37],[2,38,2,40],[2,41,2,46]]}
[null,null,null,null,"Census Validation",null,null,null,null,"=IF(MONTH($E$18)<10,BO6,BP6)",null,null,null,"=IF(MONTH($E$18)<10,BT6,BU6)",null,"Only need these formulas if a quarterly filing happens, then also go to columns BM - BZ",null,null,null,null,null,null,null,null,1,2,3,4,5,6,7,8,9,10,11,12,13,14,15,16,17,18,19,20,21,22,23,24,25,26,null,"Age Factors"]
[null,"Company (radio buttons)",null,null,null,null,"Area Factors",null,null,null,null,null,null,null,null,null,null,null,null,null,null,null,null,null,null,null,null,null,null,null,null,null,null,null,null,null,null,null,null,null,null,null,null,null,null,null,null,null,null,null,null," ",2019,null,null,null,2017,null,null,null,"This page only."]
[null,2,"1=WPS Health Plan,  2=WPS",null,"E",null,"Rated","WPS Health Plan","WHP",null,null,null,"WPS",null,null,null,null,null,null,null,null,null,null,null,null,null,"Benefit","Deductible",null,"In-Network",null,null,"Copays",null,null,null,null,null,"Out-of-Network",null,null,"Copays",null,null,null,null,null,"Drug Benefit - Long","Drug Benefit - Short","Family",null,null,"ACA","Non -",null,null,"ACA",null,null,null,null,null,null,null,"WPS Health Plan","WHP",null,null,null,null,"WPS",null,null,null,null,null,"Q1 - Q3","Q4"]
[null,{"$f":"IF(B3=1,\"WPS Health Plan\",IF(B3=2,\"WPS\",\"Co err\"))","v":"WPS"},null,null,"S",null,"Counties","Counties","Reg","Fx",null,"WPS counties","Reg","Fx",null,"Plan Benefits Dropdown Display",null,"WPS Health Plan","HIOS ID","WPS","HIOS ID","WPS Health Plan - OOS","WPS - OOS",null,"Plan Marketing Name","HIOS ID","Factor","Type","Style","Deduct","Coins","OOP","Teledoc","Rtl Clinic","PCP","Spcl","Urgent","ER","Deduct","Coins","OOP","Teledoc","Rtl Clinic","PCP","Spcl","Urgent","ER","Generic Pref/Generic Non-Pref/Brand Pref/Brand Non-Pref/Specialty","Gen Pref/Gen NP/Brnd Pref/Brnd NP/Spcl","Deductible",null,"Age","Factor","Smoker",null,"Age","Factor",null,null,null,null,null,null,null,"Counties","Reg","Fx",null,null,"WPS counties","Reg","Fx",null,null,"Plan Marketing Name","HIOS ID","Factor","Factor"]
[null,null,null,null,"D",null,null,null,null,null,null,null,null,null,null,null,null,null,null,null,null,null,null,1,"WPS PPO Platinum $500","81974WI1930002",0.93320000000000003,"PPO Copay","Copay",500,"20%",1700,0,10,35,70,null,500,1000,"50%",11000,"no cvrge","D/C","D/C","D/C",null,500,"$10 Gnr Pref / $25 Gnr Non-Pref / $50 Brnd Pref / $90 Brnd Non-Pref / Spcl Plan Deductible, then Coinsurance","$10 / $25 / $50 / $90 / D/C"," ",null,0,0.76500000000000001,{"$f":"ROUND(BA5*'Rating Formula'!$C$12,2)","v":{"$error":"#N/A"}},null,0,0.63500000000000001,null,null,null,null,null,null,null,null,null,"Q1-Q3","Q4",null,null,null,"Q1-Q3","Q4",null,"WPS WI PPO Platinum 500","81974WI1930002",0.98580000000000001,0.9365]
["Print Controls",null,null,null,null,1,{"$f":"IF($B$4=\"WPS\",L6,IF(H6=\"\",\"\",H6))","v":"ADAMS"},"BROWN",16,0.75600000000000001,null,"ADAMS",15,1.0980000000000001,null,{"$f":"IF(LEFT($C$15,12)=\"First Health\",IF($B$4=\"WPS Health Plan\",IF(V6=\"\",\"\",V6),IF(W6=\"\",\"\",W6)),IF($B$4=\"WPS\",IF(T6=\"\",\"\",T6),IF(R6=\"\",\"\",R6)))","v":"WPS PPO Platinum $500"},1,"WPS HMO Platinum $500","84670WI1330101","WPS PPO Platinum $500","81974WI1930002",{"$f":"R48","v":"WPS POS Platinum $500 OOS"},{"$f":"T27","v":"WPS PPO Platinum $500 OOS"},2,"WPS PPO Gold $1,000","81974WI1930009",0.77559999999999996,"PPO Copay","Copay",1000,"20%",7350,0,10,35,70,null,500,2000,"50%",12000,"no cvrge","D/C","D/C","D/C",null,500,"$10 Gnr Pref / $25 Gnr Non-Pref / $50 Brnd Pref / $90 Brnd Non-Pref / Spcl Plan Deductible, then Coinsurance","$10 / $25 / $50 / $90 / D/C"," ",null,15,0.83299999999999996,{"$f":"ROUND(BA6*'Rating Formula'!$C$12,2)","v":{"$error":"#N/A"}},null,15,0.63500000000000001,null,null,null,null,null,null,null,"BROWN",16,0.75600000000000001,0.75600000000000001,null,"ADAMS",15,1.0980000000000001,1.0980000000000001,null,"WPS WI PPO Gold 1000","81974WI1930009",0.81430000000000002,0.79390000000000005]
[true,"Group Rate Summary Print checkbox",null,null,null,{"$f":"1+F6","v":2},"ASHLAND","CALUMET",11,0.72699999999999998,null,"ASHLAND",5,1.2569999999999999,null,{"$f":"IF(LEFT($C$15,12)=\"First Health\",IF($B$4=\"WPS Health Plan\",IF(V7=\"\",\"\",V7),IF(W7=\"\",\"\",W7)),IF($B$4=\"WPS\",IF(T7=\"\",\"\",T7),IF(R7=\"\",\"\",R7)))","v":"WPS PPO Gold $1,000"},{"$f":"1+Q6","v":2},"WPS HMO Gold $1,000","84670WI1330102","WPS PPO Gold $1,000","81974WI1930009",{"$f":"R49","v":"WPS POS Gold $1,000 OOS"},{"$f":"T28","v":"WPS PPO Gold $1,000 OOS"},3,"WPS PPO Gold $1,500","81974WI1930040",0.76980000000000004,"PPO Copay","Copay",1500,"10%",6750,0,10,35,70,null,500,3000,"50%",13000,"no cvrge","D/C","D/C","D/C",null,500,"$10 Gnr Pref / $25 Gnr Non-Pref / $50 Brnd Pref / $90 Brnd Non-Pref / Spcl Plan Deductible, then Coinsurance","$10 / $25 / $50 / $90 / D/C"," ",null,16,0.85899999999999999,{"$f":"ROUND(BA7*'Rating Formula'!$C$12,2)","v":{"$error":"#N/A"}},null,16,0.63500000000000001,null,null,null,null,null,null,null,"CALUMET",11,0.72699999999999998,0.72699999999999998,null,"ASHLAND",5,1.2569999999999999,1.2569999999999999,null,"WPS WI PPO Gold 1500","81974WI1930040",0.79310000000000003,0.77329999999999999]
[false,"Age Rate Matrix Print checkbox",null,null,null,{"$f":"1+F7","v":3},"BARRON","DODGE",11,0.72699999999999998,null,"BARRON",8,1.22,null,"WPS PPO Gold $1,500",3,"WPS HMO Gold $1,500","84670WI1330104","WPS PPO Gold $1,500","81974WI1930040","WPS POS Gold $1,500 OOS","WPS PPO Gold $1,500 OOS",4,"WPS PPO Gold $2,000","81974WI1930041",0.74529999999999996,"PPO Copay","Copay",2000,"20%",5950,0,10,35,70,null,500,4000,"50%",14000,"no cvrge","D/C","D/C","D/C",null,500,"$10 Gnr Pref / $25 Gnr Non-Pref / $50 Brnd Pref / $90 Brnd Non-Pref / Spcl Plan Deductible, then Coinsurance","$10 / $25 / $50 / $90 / D/C"," ",null,17,0.88500000000000001,{"$f":"ROUND(BA8*'Rating Formula'!$C$12,2)","v":{"$error":"#N/A"}},null,17,0.63500000000000001,null,null,null,null,null,null,null,"DODGE",11,0.72699999999999998,0.72699999999999998,null,"BARRON",8,1.22,1.22,null,"WPS WI PPO Gold 2000","81974WI1930041",0.75139999999999996,0.73260000000000003]
[false,"Alternates Print checkbox",null,null,null,4,"BAYFIELD","DOOR",16,0.75600000000000001,null,"BAYFIELD",5,1.2569999999999999,null,"WPS PPO Gold $2,000",4,"WPS HMO Gold $2,000","84670WI1330125","WPS PPO Gold $2,000","81974WI1930041","WPS POS Gold $2,000 OOS","WPS PPO Gold $2,000 OOS",5,"WPS PPO Gold $2,500","81974WI1930042",0.74329999999999996,"PPO Copay","Copay",2500,"20%",5800,0,10,35,70,null,500,5000,"50%",15000,"no cvrge","D/C","D/C","D/C",null,500,"$10 Gnr Pref / $25 Gnr Non-Pref / $50 Brnd Pref / $90 Brnd Non-Pref / Spcl Plan Deductible, then Coinsurance","$10 / $25 / $50 / $90 / D/C",null,null,18,0.91300000000000003,{"$f":"ROUND(BA9*'Rating Formula'!$C$12,2)","v":{"$error":"#N/A"}},null,18,0.63500000000000001,null,null,null,null,null,null,null,"DOOR",16,0.75600000000000001,0.75600000000000001,null,"BAYFIELD",5,1.2569999999999999,1.2569999999999999,null,"WPS WI PPO Gold 2500","81974WI1930042",0.74350000000000005,0.72489999999999999]
[null,null,null,null,null,5,"BUFFALO","FOND DU LAC",11,0.72699999999999998,null,"BUFFALO",6,1.365,null,"WPS PPO Gold $2,500",5,"WPS HMO Gold $2,500","84670WI1330126","WPS PPO Gold $2,500","81974WI1930042","WPS POS Gold $2,500 OOS","WPS PPO Gold $2,500 OOS",6,"WPS PPO Silver $5,000","81974WI1930033",0.66459999999999997,"PPO Copay","Copay",5000,"25%",9200,0,10,50,100,null,750,10000,"50%",20000,"no cvrge","D/C","D/C","D/C",null,750,"$20 Gnr Pref / $40 Gnr Non-Pref / $80 Brnd Pref / $125 Brnd Non-Pref / Spcl Plan Deductible, then Coinsurance","$20 / $40 / $80 / $125 / D/C"," ",null,19,0.94099999999999995,{"$f":"ROUND(BA10*'Rating Formula'!$C$12,2)","v":{"$error":"#N/A"}},null,19,0.63500000000000001,null,null,null,null,null,null,null,"FOND DU LAC",11,0.72699999999999998,0.72699999999999998,null,"BROWN",16,0.92800000000000005,0.92800000000000005,null,"WPS WI PPO Silver 3000","81974WI1930033",0.69889999999999997,0.69889999999999997]
[null,null,"Networks",null,null,6,"BURNETT","GREEN LAKE",15,0.91,null,"BURNETT",5,1.2569999999999999,null,"WPS PPO Silver $5,000",6,"WPS HMO Silver $5,000","84670WI1330106","WPS PPO Silver $5,000","81974WI1930033","WPS POS Silver $5,000 OOS","WPS PPO Silver $5,000 OOS",7,"WPS PPO Silver $5,500","81974WI1930047",0.65329999999999999,"PPO Copay","Copay",5500,"25%",9200,0,10,50,100,null,750,11000,"50%",21000,"no cvrge","D/C","D/C","D/C",null,750,"$20 Gnr Pref / $40 Gnr Non-Pref / $80 Brnd Pref / $125 Brnd Non-Pref / Spcl Plan Deductible, then Coinsurance","$20 / $40 / $80 / $125 / D/C"," ",null,20,0.97,{"$f":"ROUND(BA11*'Rating Formula'!$C$12,2)","v":{"$error":"#N/A"}},null,20,0.63500000000000001,null,null,null,null,null,null,null,"GREEN LAKE",15,0.91,0.91,null,"BUFFALO",6,1.365,1.365,null,"WPS WI PPO Silver 3500","81974WI1930032",0.70320000000000005,0.70320000000000005]
[null,null,null,"WPS Health Plan","WPS",7,"CALUMET","KENOSHA",9,0.93400000000000005,null,"CALUMET",11,0.97599999999999998,null,"WPS PPO Silver $5,500",7,"WPS HMO Silver $5,500","84670WI1330136","WPS PPO Silver $5,500","81974WI1930047","WPS POS Silver $5,500 OOS",{"$f":"T33","v":"WPS PPO Silver $5,500 OOS"},8,"WPS PPO Silver $5,700","81974WI1930032",0.66379999999999995,"PPO Copay","Copay",5700,"15%",9200,0,10,50,100,null,750,11400,"50%",21400,"no cvrge","D/C","D/C","D/C",null,750,"$20 Gnr Pref / $40 Gnr Non-Pref / $80 Brnd Pref / $125 Brnd Non-Pref / Spcl Plan Deductible, then Coinsurance","$20 / $40 / $80 / $125 / D/C"," ",null,21,1,{"$f":"ROUND(BA12*'Rating Formula'!$C$12,2)","v":{"$error":"#N/A"}},null,null,null,null,null,null,null,null,null,null,"KENOSHA",9,0.99399999999999999,0.93400000000000005,null,"BURNETT",5,1.2569999999999999,1.2569999999999999,null,"WPS WI PPO Silver 4500 0%","81974WI1930046",0.7379,0.7379]
[null,null,{"$f":"IF($B$4=\"WPS Health Plan\",D13,E13)","v":"WPS Statewide"},"WPS Select Plus","WPS Statewide",8,"CHIPPEWA","KEWAUNEE",16,0.75600000000000001,null,"CHIPPEWA",4,1.369,null,"WPS PPO Silver $5,700",8,"WPS HMO Silver $5,700","84670WI1330107","WPS PPO Silver $5,700","81974WI1930032","WPS POS Silver $5,700 OOS","WPS PPO Silver $5,700 OOS",9,"WPS PPO Silver $6,000","81974WI1930044",0.65880000000000005,"PPO Copay","Copay",6000,"25%",9000,0,10,50,100,null,750,12000,"50%",22000,"no cvrge","D/C","D/C","D/C",null,750,"$20 Gnr Pref / $40 Gnr Non-Pref / $80 Brnd Pref / $125 Brnd Non-Pref / Spcl Plan Deductible, then Coinsurance","$20 / $40 / $80 / $125 / D/C"," ",null,22,1,{"$f":"ROUND(BA13*'Rating Formula'!$C$12,2)","v":{"$error":"#N/A"}},null,null,null,null,null,null,null,null,null,null,"KEWAUNEE",16,0.75600000000000001,0.75600000000000001,null,"CALUMET",11,0.97599999999999998,0.97599999999999998,null,"WPS WI PPO Silver 4500 20%","81974WI1930044",0.68049999999999999,0.68049999999999999]
[null,null,{"$f":"IF($B$4=\"WPS Health Plan\",D14,E14)","v":"First Health"},"First Health POS","First Health",9,"CLARK","MANITOWOC",16,0.75600000000000001,null,"CLARK",8,1.22,null,"WPS PPO Silver $6,000",9,"WPS HMO Silver $6,000","84670WI1330128","WPS PPO Silver $6,000","81974WI1930044","WPS POS Silver $6,000 OOS","WPS PPO Silver $6,000 OOS",10,"WPS PPO Silver $6,500","81974WI1930048",0.64649999999999996,"PPO Copay","Copay",6500,"35%",9200,0,10,50,100,null,750,13000,"50%",23000,"no cvrge","D/C","D/C","D/C",null,750,"$20 Gnr Pref / $40 Gnr Non-Pref / $80 Brnd Pref / $125 Brnd Non-Pref / Spcl Plan Deductible, then Coinsurance","$20 / $40 / $80 / $125 / D/C"," ",null,23,1,{"$f":"ROUND(BA14*'Rating Formula'!$C$12,2)","v":{"$error":"#N/A"}},null,null,null,null,null,null,null,null,null,null,"MANITOWOC",16,0.75600000000000001,0.75600000000000001,null,"CHIPPEWA",4,1.369,1.369,null,"WPS WI PPO Silver 5500","81974WI1930047",0.67420000000000002,0.67420000000000002]
[null,null,{"$f":"Input!E15","v":0},null,null,10,"COLUMBIA","MARINETTE",16,0.75600000000000001,null,"COLUMBIA",14,1.0449999999999999,null,"WPS PPO Silver $6,500",10,"WPS HMO Silver $6,500","84670WI1330137","WPS PPO Silver $6,500","81974WI1930048","WPS POS Silver $6,500 OOS","WPS PPO Silver $6,500 OOS",11,"WPS PPO Silver $9,000","81974WI1930046",0.68859999999999999,"PPO Copay","Copay",9000,"0%",9000,0,10,50,100,null,750,18000,"30%",24000,"no cvrge","D/C","D/C","D/C",null,750,"$20 Gnr Pref / $40 Gnr Non-Pref / $80 Brnd Pref / $125 Brnd Non-Pref / Spcl Plan Deductible, then Coinsurance","$20 / $40 / $80 / $125 / D/C"," ",null,24,1,{"$f":"ROUND(BA15*'Rating Formula'!$C$12,2)","v":{"$error":"#N/A"}},null,null,null,null,null,null,null,null,null,null,"MARINETTE",16,0.75600000000000001,0.75600000000000001,null,"CLARK",8,1.22,1.22,null,"WPS WI PPO Silver 6500","81974WI1930048",0.67049999999999998,0.67049999999999998]
[null,null,null,null,null,11,"CRAWFORD","MARQUETTE",15,0.91,null,"CRAWFORD",7,1.165,null,"WPS PPO Silver $9,000",11,"WPS HMO Silver $8,100","84670WI1330135","WPS PPO Silver $9,000","81974WI1930046","WPS POS Silver $8,100 OOS","WPS PPO Silver $9,000 OOS",12,"WPS PPO HDHP Gold $3,000","81974WI1930022",0.77880000000000005,"Non-Embedded HDHP","D/C",3000,"0%",3000,"D/C","D/C","D/C","D/C","D/C","D/C",6000,"30%",12000,"no cvrge","D/C","D/C","D/C",null,"D/C","Plan Deductible, then Coinsurance","Plan Deductible, then Coinsurance","(Non-Embedded)",null,25,1.004,{"$f":"ROUND(BA16*'Rating Formula'!$C$12,2)","v":{"$error":"#N/A"}},null,null,null,null,null,null,null,null,null,null,"MARQUETTE",15,0.91,0.91,null,"COLUMBIA",14,1.0449999999999999,1.0449999999999999,null,"WPS WI PPO HDHP Gold 2000","81974WI1930022",0.83389999999999997,0.81310000000000004]
[null,"Trend and Renewal Dates",null,null,null,12,"DANE","MILWAUKEE",1,0.83799999999999997,null,"DANE",2,1.431,null,"WPS PPO HDHP Gold $3,000",12,"WPS HMO HDHP Gold $2,600","84670WI1330114","WPS PPO HDHP Gold $3,000","81974WI1930022","WPS POS HDHP Gold $2,600 OOS","WPS PPO HDHP Gold $3,000 OOS",13,"WPS PPO HDHP Gold $3,750","81974WI1930049",0.7671,"Embedded HDHP","D/C",3750,"0%",3750,"D/C","D/C","D/C","D/C","D/C","D/C",7500,"30%",13500,"no cvrge","D/C","D/C","D/C",null,"D/C","Plan Deductible, then Coinsurance","Plan Deductible, then Coinsurance","(Embedded)",null,26,1.024,{"$f":"ROUND(BA17*'Rating Formula'!$C$12,2)","v":{"$error":"#N/A"}},null,null,null,null,null,null,null,null,null,null,"MILWAUKEE",1,0.88200000000000001,0.83799999999999997,null,"CRAWFORD",7,1.165,1.165,null,"WPS WI PPO HDHP Gold 2800","81974WI1930049",0.81189999999999996,0.79159999999999997]
[null,null,{"$f":"VLOOKUP(Input!E11,Tables!$C$20:$D$31,2,FALSE)","v":{"$error":"#N/A"}},null,{"$f":"VLOOKUP(Input!E11,Tables!$C$20:$E$31,3,FALSE)","v":{"$error":"#N/A"}},13,"DODGE","OCONTO",16,0.75600000000000001,null,"DODGE",11,0.97599999999999998,null,"WPS PPO HDHP Gold $3,750",13,"WPS HMO HDHP Gold $3,500","84670WI1330138","WPS PPO HDHP Gold $3,750","81974WI1930049","WPS POS HDHP Gold $3,500 OOS","WPS PPO HDHP Gold $3,750 OOS",14,"WPS PPO HDHP Silver $2,500","81974WI1930023",0.63959999999999995,"Non-Embedded HDHP","D/C",2500,"30%",8000,"D/C","D/C","D/C","D/C","D/C","D/C",5000,"50%",15000,"no cvrge","D/C","D/C","D/C",null,"D/C","Plan Deductible, then Coinsurance","Plan Deductible, then Coinsurance","(Non-Embedded)",null,27,1.048,{"$f":"ROUND(BA18*'Rating Formula'!$C$12,2)","v":{"$error":"#N/A"}},null,null,null,null,null,null,null,null,null,null,"OCONTO",16,0.75600000000000001,0.75600000000000001,null,"DANE",2,1.431,1.431,null,"WPS WI PPO HDHP Silver 1550","81974WI1930025",0.67949999999999999,0.67949999999999999]
[null,null,null,"Trend","Date",14,"DOOR","OUTAGAMIE",11,0.72699999999999998,null,"DOOR",16,0.92800000000000005,null,"WPS PPO HDHP Silver $2,500",14,"WPS HMO HDHP Silver $2,500","84670WI1330116","WPS PPO HDHP Silver $2,500","81974WI1930023","WPS POS HDHP Silver $2,500 OOS","WPS PPO HDHP Silver $2,500 OOS",15,"WPS PPO HDHP Silver $3,300","81974WI1930035",0.64510000000000001,"Embedded HDHP","D/C",3300,"20%",8300,"D/C","D/C","D/C","D/C","D/C","D/C",6600,"50%",16600,"no cvrge","D/C","D/C","D/C",null,"D/C","Plan Deductible, then Coinsurance","Plan Deductible, then Coinsurance","(Embedded)",null,28,1.087,{"$f":"ROUND(BA19*'Rating Formula'!$C$12,2)","v":{"$error":"#N/A"}},null,null,null,null,null,null,null,null,null,null,"OUTAGAMIE",11,0.72699999999999998,0.72699999999999998,null,"DODGE",11,0.97599999999999998,0.97599999999999998,null,"WPS WI PPO HDHP Silver 2500","81974WI1930023",0.63690000000000002,0.63690000000000002]
[null,"Q1","January 1, 2025",0.97838615971282161,"2025-01-01",15,"DOUGLAS","OZAUKEE",12,0.80200000000000005,null,"DOUGLAS",5,1.2569999999999999,null,"WPS PPO HDHP Silver $3,300",15,"WPS HMO HDHP Silver $3,000","84670WI1330117","WPS PPO HDHP Silver $3,300","81974WI1930035","WPS POS HDHP Silver $3,000 OOS","WPS PPO HDHP Silver $3,300 OOS",16,"WPS PPO HDHP Silver $3,500","81974WI1930050",0.64539999999999997,"Embedded HDHP","D/C",3500,"20%",8300,"D/C","D/C","D/C","D/C","D/C","D/C",7000,"50%",17000,"no cvrge","D/C","D/C","D/C",null,"D/C","Plan Deductible, then Coinsurance","Plan Deductible, then Coinsurance","(Embedded)",null,29,1.119,{"$f":"ROUND(BA20*'Rating Formula'!$C$12,2)","v":{"$error":"#N/A"}},null,null,null,null,null,null,null,null,null,null,"OZAUKEE",12,0.84399999999999997,0.80200000000000005,null,"DOOR",16,0.92800000000000005,0.92800000000000005,null,"WPS WI PPO HDHP Silver 2700","81974WI1930035",0.66059999999999997,0.66059999999999997]
[null,null,"February 1, 2025",0.97838615971282161,"2025-02-01",16,"DUNN","RACINE",9,0.93400000000000005,null,"DUNN",4,1.369,null,"WPS PPO HDHP Silver $3,500",16,"WPS HMO HDHP Silver $3,500","84670WI1330139","WPS PPO HDHP Silver $3,500","81974WI1930050","WPS POS HDHP Silver $3,500 OOS","WPS PPO HDHP Silver $3,500 OOS",17,"WPS PPO HDHP Silver $4,000","81974WI1930025",0.62960000000000005,"Embedded HDHP","D/C",4000,"30%",7500,"D/C","D/C","D/C","D/C","D/C","D/C",8000,"50%",18000,"no cvrge","D/C","D/C","D/C",null,"D/C","Plan Deductible, then Coinsurance","Plan Deductible, then Coinsurance","(Embedded)",null,30,1.135,{"$f":"ROUND(BA21*'Rating Formula'!$C$12,2)","v":{"$error":"#N/A"}},null,null,null,null,null,null,null,null,null,null,"RACINE",9,0.99399999999999999,0.93400000000000005,null,"DOUGLAS",5,1.2569999999999999,1.2569999999999999,null,"WPS WI PPO HDHP Silver 3500","81974WI1930050",0.64500000000000002,0.64500000000000002]
[null,null,"March 1, 2025",0.97838615971282161,"2025-03-01",17,"EAU CLAIRE","SHAWANO",16,0.75600000000000001,null,"EAU CLAIRE",4,1.369,null,"WPS PPO HDHP Silver $4,000",17,"WPS HMO HDHP Silver $4,000","84670WI1330115","WPS PPO HDHP Silver $4,000","81974WI1930025","WPS POS HDHP Silver $4,000 OOS","WPS PPO HDHP Silver $4,000 OOS",18,"WPS PPO HDHP Silver $5,100","81974WI1930037",0.66710000000000003,"Embedded HDHP","D/C",5100,"0%",5100,"D/C","D/C","D/C","D/C","D/C","D/C",10200,"30%",16200,"no cvrge","D/C","D/C","D/C",null,"D/C","Plan Deductible, then Coinsurance","Plan Deductible, then Coinsurance","(Embedded)",null,31,1.159,{"$f":"ROUND(BA22*'Rating Formula'!$C$12,2)","v":{"$error":"#N/A"}},null,null,null,null,null,null,null,null,null,null,"SHAWANO",16,0.75600000000000001,0.75600000000000001,null,"DUNN",4,1.369,1.369,null,"WPS WI PPO HDHP Silver 3850","81974WI1930037",0.69420000000000004,0.69420000000000004]
[null,"Q2","April 1, 2025",0.99274284771399302,"2025-04-01",18,"FLORENCE","SHEBOYGAN",11,0.72699999999999998,null,"FLORENCE",13,1.135,null,"WPS PPO HDHP Silver $5,100",18,"WPS HMO HDHP Silver $4,800","84670WI1330120","WPS PPO HDHP Silver $5,100","81974WI1930037","WPS POS HDHP Silver $4,800 OOS","WPS PPO HDHP Silver $5,100 OOS",19,"WPS PPO HDHP Silver $6,000","81974WI1930051",0.65039999999999998,"Embedded HDHP","D/C",6000,"0%",6000,"D/C","D/C","D/C","D/C","D/C","D/C",12000,"30%",18000,"no cvrge","D/C","D/C","D/C",null,"D/C","Plan Deductible, then Coinsurance","Plan Deductible, then Coinsurance","(Embedded)",null,32,1.1830000000000001,{"$f":"ROUND(BA23*'Rating Formula'!$C$12,2)","v":{"$error":"#N/A"}},null,null,null,null,null,null,null,null,null,null,"SHEBOYGAN",11,0.72699999999999998,0.72699999999999998,null,"EAU CLAIRE",4,1.369,1.369,null,"WPS WI PPO HDHP Bronze 5500","81974WI1930027",0.59909999999999997,0.59909999999999997]
[null,null,"May 1, 2025",0.99274284771399302,"2025-05-01",19,"FOREST","WALWORTH",14,0.86399999999999999,null,"FOREST",13,1.135,null,"WPS PPO HDHP Silver $6,000",19,"WPS HMO HDHP Silver $5,500","84670WI1330140","WPS PPO HDHP Silver $6,000","81974WI1930051","WPS POS HDHP Silver $5,500 OOS","WPS PPO HDHP Silver $6,000 OOS",20,"WPS PPO HDHP Bronze $6,500","81974WI1930027",0.57720000000000005,"Embedded HDHP","D/C",6500,"30%",8300,"D/C","D/C","D/C","D/C","D/C","D/C",13000,"50%",23000,"no cvrge","D/C","D/C","D/C",null,"D/C","Plan Deductible, then Coinsurance","Plan Deductible, then Coinsurance","(Embedded)",null,33,1.198,{"$f":"ROUND(BA24*'Rating Formula'!$C$12,2)","v":{"$error":"#N/A"}},null,null,null,null,null,null,null,null,null,null,"WALWORTH",14,0.90900000000000003,0.86399999999999999,null,"FLORENCE",13,1.135,1.135,null,"WPS WI PPO HDHP Bronze 6750","81974WI1930026",0.58560000000000001,0.58560000000000001]
[null,null,"June 1, 2025",0.99274284771399302,"2025-06-01",20,"GRANT","WASHINGTON",12,0.80200000000000005,null,"GRANT",7,1.165,null,"WPS PPO HDHP Bronze $6,500",20,"WPS HMO HDHP Bronze $6,000","84670WI1330122","WPS PPO HDHP Bronze $6,500","81974WI1930027","WPS POS HDHP Bronze $6,000 OOS","WPS PPO HDHP Bronze $6,500 OOS",21,"WPS PPO HDHP Bronze $8,300","81974WI1930026",0.56279999999999997,"Embedded HDHP","D/C",8300,"0%",8300,"D/C","D/C","D/C","D/C","D/C","D/C",16600,"30%",22600,"no cvrge","D/C","D/C","D/C",null,"D/C","Plan Deductible, then Coinsurance","Plan Deductible, then Coinsurance","(Embedded)",null,34,1.214,{"$f":"ROUND(BA25*'Rating Formula'!$C$12,2)","v":{"$error":"#N/A"}},null,null,null,null,null,null,null,null,null,null,"WASHINGTON",12,0.84399999999999997,0.80200000000000005,null,"FOND DU LAC",11,0.97599999999999998,0.97599999999999998,null,"WPS WI PPO Platinum 500 OOS","81974WI1930002FH",0.98580000000000001,0.9365]
[null,"Q3","July 1, 2025",1.0073102035463848,"2025-07-01",21,"GREEN","WAUKESHA",12,0.80200000000000005,null,"GREEN",14,1.0449999999999999,null,"WPS PPO HDHP Bronze $8,300",21,"WPS HMO HDHP Bronze $7,500","84670WI1330123","WPS PPO HDHP Bronze $8,300","81974WI1930026","WPS POS HDHP Bronze $7,500 OOS","WPS PPO HDHP Bronze $8,300 OOS",22,"WPS PPO Platinum $500 OOS","81974WI1930002FH",0.93320000000000003,"PPO Copay","Copay",500,"20%",1700,0,10,35,70,null,500,1000,"50%",11000,"no cvrge","D/C","D/C","D/C",null,500,"$10 Gnr Pref / $25 Gnr Non-Pref / $50 Brnd Pref / $90 Brnd Non-Pref / Spcl Plan Deductible, then Coinsurance","$10 / $25 / $50 / $90 / D/C"," ",null,35,1.222,{"$f":"ROUND(BA26*'Rating Formula'!$C$12,2)","v":{"$error":"#N/A"}},null,null,null,null,null,null,null,null,null,null,"WAUKESHA",12,0.84399999999999997,0.80200000000000005,null,"FOREST",13,1.135,1.135,null,"WPS WI PPO Gold 1000 OOS","81974WI1930009FH",0.81430000000000002,0.79390000000000005]
[null,null,"August 1, 2025",1.0073102035463848,"2025-08-01",22,"GREEN LAKE","WAUPACA",11,0.72699999999999998,null,"GREEN LAKE",15,1.0980000000000001,null,"WPS PPO Platinum $500 OOS",{"$f":"1+Q26","v":22},"WPS POS Platinum $500","84670WI1350101",{"$f":"T6&\" OOS\"","v":"WPS PPO Platinum $500 OOS"},{"$f":"U6&\"FH\"","v":"81974WI1930002FH"},null,null,23,"WPS PPO Gold $1,000 OOS","81974WI1930009FH",0.77559999999999996,"PPO Copay","Copay",1000,"20%",7350,0,10,35,70,null,500,2000,"50%",12000,"no cvrge","D/C","D/C","D/C",null,500,"$10 Gnr Pref / $25 Gnr Non-Pref / $50 Brnd Pref / $90 Brnd Non-Pref / Spcl Plan Deductible, then Coinsurance","$10 / $25 / $50 / $90 / D/C"," ",null,36,1.23,{"$f":"ROUND(BA27*'Rating Formula'!$C$12,2)","v":{"$error":"#N/A"}},null,null,null,null,null,null,null,null,null,null,"WAUPACA",11,0.72699999999999998,0.72699999999999998,null,"GRANT",7,1.165,1.165,null,"WPS WI PPO Gold 1500 OOS","81974WI1930040FH",0.79310000000000003,0.77329999999999999]
[null,null,"September 1, 2025",1.0073102035463848,"2025-09-01",23,"IOWA","WAUSHARA",11,0.72699999999999998,null,"IOWA",7,1.165,null,"WPS PPO Gold $1,000 OOS",23,"WPS POS Gold $1,000","84670WI1350102",{"$f":"T7&\" OOS\"","v":"WPS PPO Gold $1,000 OOS"},{"$f":"U7&\"FH\"","v":"81974WI1930009FH"},null,null,24,"WPS PPO Gold $1,500 OOS","81974WI1930040FH",0.76980000000000004,"PPO Copay","Copay",1500,"10%",6750,0,10,35,70,null,500,3000,"50%",13000,"no cvrge","D/C","D/C","D/C",null,500,"$10 Gnr Pref / $25 Gnr Non-Pref / $50 Brnd Pref / $90 Brnd Non-Pref / Spcl Plan Deductible, then Coinsurance","$10 / $25 / $50 / $90 / D/C"," ",null,37,1.238,{"$f":"ROUND(BA28*'Rating Formula'!$C$12,2)","v":{"$error":"#N/A"}},null,null,null,null,null,null,null,null,null,null,"WAUSHARA",11,0.72699999999999998,0.72699999999999998,null,"GREEN",14,1.0449999999999999,1.0449999999999999,null,"WPS WI PPO Gold 2000 OOS","81974WI1930041FH",0.75139999999999996,0.73260000000000003]
[null,"Q4","October 1, 2025",1.0220913185173455,"2025-10-01",24,"IRON","WINNEBAGO",11,0.72699999999999998,null,"IRON",13,1.135,null,{"$f":"IF(LEFT($C$15,12)=\"First Health\",IF($B$4=\"WPS Health Plan\",IF(V29=\"\",\"\",V29),IF(W29=\"\",\"\",W29)),IF($B$4=\"WPS\",IF(T29=\"\",\"\",T29),IF(R29=\"\",\"\",R29)))","v":"WPS PPO Gold $1,500 OOS"},24,"WPS POS Gold $1,500","84670WI1350104","WPS PPO Gold $1,500 OOS","81974WI1930040FH",null,null,25,"WPS PPO Gold $2,000 OOS","81974WI1930041FH",0.74529999999999996,"PPO Copay","Copay",2000,"20%",5950,0,10,35,70,null,500,4000,"50%",14000,"no cvrge","D/C","D/C","D/C",null,500,"$10 Gnr Pref / $25 Gnr Non-Pref / $50 Brnd Pref / $90 Brnd Non-Pref / Spcl Plan Deductible, then Coinsurance","$10 / $25 / $50 / $90 / D/C"," ",null,38,1.246,{"$f":"ROUND(BA29*'Rating Formula'!$C$12,2)","v":{"$error":"#N/A"}},null,null,null,null,null,null,null,null,null,null,"WINNEBAGO",11,0.72699999999999998,0.72699999999999998,null,"GREEN LAKE",15,1.0980000000000001,1.0980000000000001,null,"WPS WI PPO Gold 2500 OOS","81974WI1930042FH",0.74350000000000005,0.72489999999999999]
[null,null,"November 1, 2025",1.0220913185173455,"2025-11-01",25,"JACKSON",null,null,null,null,"JACKSON",6,1.365,null,"WPS PPO Gold $2,000 OOS",25,"WPS POS Gold $2,000","84670WI1350125","WPS PPO Gold $2,000 OOS","81974WI1930041FH",null,null,26,"WPS PPO Gold $2,500 OOS","81974WI1930042FH",0.74329999999999996,"PPO Copay","Copay",2500,"20%",5800,0,10,35,70,null,500,5000,"50%",15000,"no cvrge","D/C","D/C","D/C",null,500,"$10 Gnr Pref / $25 Gnr Non-Pref / $50 Brnd Pref / $90 Brnd Non-Pref / Spcl Plan Deductible, then Coinsurance","$10 / $25 / $50 / $90 / D/C",null,null,39,1.262,{"$f":"ROUND(BA30*'Rating Formula'!$C$12,2)","v":{"$error":"#N/A"}},null,null,null,null,null,null,null,null,null,null,null,null,null,null,null,"IOWA",7,1.165,1.165,null,"WPS WI PPO Silver 3000 OOS","81974WI1930033FH",0.69889999999999997,0.69889999999999997]
[null,null,"December 1, 2025",1.0220913185173455,"2025-12-01",26,"JEFFERSON",null,null,null,null,"JEFFERSON",14,1.0449999999999999,null,"WPS PPO Gold $2,500 OOS",26,"WPS POS Gold $2,500","84670WI1350126","WPS PPO Gold $2,500 OOS","81974WI1930042FH",null,null,27,"WPS PPO Silver $5,000 OOS","81974WI1930033FH",0.66459999999999997,"PPO Copay","Copay",5000,"25%",9200,0,10,50,100,null,750,10000,"50%",20000,"no cvrge","D/C","D/C","D/C",null,750,"$20 Gnr Pref / $40 Gnr Non-Pref / $80 Brnd Pref / $125 Brnd Non-Pref / Spcl Plan Deductible, then Coinsurance","$20 / $40 / $80 / $125 / D/C"," ",null,40,1.278,{"$f":"ROUND(BA31*'Rating Formula'!$C$12,2)","v":{"$error":"#N/A"}},null,null,null,null,null,null,null,null,null,null,null,null,null,null,null,"IRON",13,1.135,1.135,null,"WPS WI PPO Silver 3500 OOS","81974WI1930032FH",0.70320000000000005,0.70320000000000005]
[null,null,null,null,null,27,"JUNEAU",null,null,null,null,"JUNEAU",15,1.0980000000000001,null,"WPS PPO Silver $5,000 OOS",27,"WPS POS Silver $5,000","84670WI1350106","WPS PPO Silver $5,000 OOS","81974WI1930033FH",null,null,28,"WPS PPO Silver $5,500 OOS","81974WI1930047FH",0.65329999999999999,"PPO Copay","Copay",5500,"25%",9200,0,10,50,100,null,750,11000,"50%",21000,"no cvrge","D/C","D/C","D/C",null,750,"$20 Gnr Pref / $40 Gnr Non-Pref / $80 Brnd Pref / $125 Brnd Non-Pref / Spcl Plan Deductible, then Coinsurance","$20 / $40 / $80 / $125 / D/C"," ",null,41,1.302,{"$f":"ROUND(BA32*'Rating Formula'!$C$12,2)","v":{"$error":"#N/A"}},null,null,null,null,null,null,null,null,null,null,null,null,null,null,null,"JACKSON",6,1.365,1.365,null,"WPS WI PPO Silver 4500 0% OOS","81974WI1930046FH",0.7379,0.7379]
[null,{"$f":"IF(Input!L20=\"D/C\",\"\",\"$\")","v":"$"},"this helps with Group Rate Summary titles",null,null,28,"KENOSHA",null,null,null,null,"KENOSHA",9,1.131,null,"WPS PPO Silver $5,500 OOS",28,"WPS POS Silver $5,500","84670WI1350136","WPS PPO Silver $5,500 OOS","81974WI1930047FH",null,null,29,"WPS PPO Silver $5,700 OOS","81974WI1930032FH",0.66379999999999995,"PPO Copay","Copay",5700,"15%",9200,0,10,50,100,null,750,11400,"50%",21400,"no cvrge","D/C","D/C","D/C",null,750,"$20 Gnr Pref / $40 Gnr Non-Pref / $80 Brnd Pref / $125 Brnd Non-Pref / Spcl Plan Deductible, then Coinsurance","$20 / $40 / $80 / $125 / D/C"," ",null,42,1.325,{"$f":"ROUND(BA33*'Rating Formula'!$C$12,2)","v":{"$error":"#N/A"}},null,null,null,null,null,null,null,null,null,null,null,null,null,null,null,"JEFFERSON",14,1.0449999999999999,1.0449999999999999,null,"WPS WI PPO Silver 4500 20% OOS","81974WI1930044FH",0.68049999999999999,0.68049999999999999]
[null,{"$f":"IF(LEFT(VLOOKUP(Input!L13,Tables!Z5:AW109,24,FALSE),4)=\"Plan\",\"D/C\",VLOOKUP(Input!L13,Tables!Z5:AW109,24,FALSE))","v":{"$error":"#N/A"}},"this helps with Group Rate Summary titles",null,null,29,"KEWAUNEE",null,null,null,null,"KEWAUNEE",16,0.92800000000000005,null,"WPS PPO Silver $5,700 OOS",29,"WPS POS Silver $5,700","84670WI1350107","WPS PPO Silver $5,700 OOS",{"$f":"U13&\"FH\"","v":"81974WI1930032FH"},null,null,30,"WPS PPO Silver $6,000 OOS","81974WI1930044FH",0.65880000000000005,"PPO Copay","Copay",6000,"25%",9000,0,10,50,100,null,750,12000,"50%",22000,"no cvrge","D/C","D/C","D/C",null,750,"$20 Gnr Pref / $40 Gnr Non-Pref / $80 Brnd Pref / $125 Brnd Non-Pref / Spcl Plan Deductible, then Coinsurance","$20 / $40 / $80 / $125 / D/C"," ",null,43,1.357,{"$f":"ROUND(BA34*'Rating Formula'!$C$12,2)","v":{"$error":"#N/A"}},null,null,null,null,null,null,null,null,null,null,null,null,null,null,null,"JUNEAU",15,1.0980000000000001,1.0980000000000001,null,"WPS WI PPO Silver 5500 OOS","81974WI1930047FH",0.67420000000000002,0.67420000000000002]
[null,{"$f":"LEFT(VLOOKUP(Input!L13,Tables!Z5:AW109,24,FALSE),4)","v":{"$error":"#N/A"}},"this helps with Group Rate Summary titles",null,null,30,"LA CROSSE",null,null,null,null,"LA CROSSE",6,1.365,null,"WPS PPO Silver $6,000 OOS",30,"WPS POS Silver $6,000","84670WI1350128","WPS PPO Silver $6,000 OOS","81974WI1930044FH",null,null,31,"WPS PPO Silver $6,500 OOS","81974WI1930048FH",0.64649999999999996,"PPO Copay","Copay",6500,"35%",9200,0,10,50,100,null,750,13000,"50%",23000,"no cvrge","D/C","D/C","D/C",null,750,"$20 Gnr Pref / $40 Gnr Non-Pref / $80 Brnd Pref / $125 Brnd Non-Pref / Spcl Plan Deductible, then Coinsurance","$20 / $40 / $80 / $125 / D/C"," ",null,44,1.397,{"$f":"ROUND(BA35*'Rating Formula'!$C$12,2)","v":{"$error":"#N/A"}},null,null,null,null,null,null,null,null,null,null,null,null,null,null,null,"KENOSHA",9,1.1910000000000001,1.131,null,"WPS WI PPO Silver 6500 OOS","81974WI1930048FH",0.67049999999999998,0.67049999999999998]
[null,{"$f":"IF(VLOOKUP(Input!L13,Z5:AX109,25,FALSE)=0,\"\",VLOOKUP(Input!L13,Z5:AX109,25,FALSE))","v":{"$error":"#N/A"}},"this helps with Group Rate Summary Ded titles",null,null,31,"LAFAYETTE",null,null,null,null,"LAFAYETTE",7,1.165,null,"WPS PPO Silver $6,500 OOS",31,"WPS POS Silver $6,500","84670WI1350137","WPS PPO Silver $6,500 OOS","81974WI1930048FH",null,null,32,"WPS PPO Silver $9,000 OOS","81974WI1930046FH",0.68859999999999999,"PPO Copay","Copay",9000,"0%",9000,0,10,50,100,null,750,18000,"30%",24000,"no cvrge","D/C","D/C","D/C",null,750,"$20 Gnr Pref / $40 Gnr Non-Pref / $80 Brnd Pref / $125 Brnd Non-Pref / Spcl Plan Deductible, then Coinsurance","$20 / $40 / $80 / $125 / D/C"," ",null,45,1.444,{"$f":"ROUND(BA36*'Rating Formula'!$C$12,2)","v":{"$error":"#N/A"}},null,null,null,null,null,null,null,null,null,null,null,null,null,null,null,"KEWAUNEE",16,0.92800000000000005,0.92800000000000005,null,"WPS WI PPO HDHP Gold 2000 OOS","81974WI1930022FH",0.83389999999999997,0.81310000000000004]
[null,null,null,null,null,32,"LANGLADE",null,null,null,null,"LANGLADE",13,1.135,null,"WPS PPO Silver $9,000 OOS",32,"WPS POS Silver $8,100","84670WI1350135",{"$f":"T16&\" OOS\"","v":"WPS PPO Silver $9,000 OOS"},"81974WI1930046FH",null,null,33,"WPS PPO HDHP Gold $3,000 OOS","81974WI1930022FH",0.77880000000000005,"Non-Embedded HDHP","D/C",3000,"0%",3000,"D/C","D/C","D/C","D/C","D/C","D/C",6000,"30%",12000,"no cvrge","D/C","D/C","D/C",null,"D/C","Plan Deductible, then Coinsurance","Plan Deductible, then Coinsurance","(Non-Embedded)",null,46,1.5,{"$f":"ROUND(BA37*'Rating Formula'!$C$12,2)","v":{"$error":"#N/A"}},null,null,null,null,null,null,null,null,null,null,null,null,null,null,null,"LA CROSSE",6,1.365,1.365,null,"WPS WI PPO HDHP Gold 2800 OOS","81974WI1930049FH",0.81189999999999996,0.79159999999999997]
[null,null,null,null,null,33,{"$f":"IF($B$4=\"WPS\",L38,IF(H38=\"\",\"\",H38))","v":"LINCOLN"},null,null,null,null,"LINCOLN",10,0.97399999999999998,null,"WPS PPO HDHP Gold $3,000 OOS",33,"WPS POS HDHP Gold $2,600","84670WI1350114","WPS PPO HDHP Gold $3,000 OOS","81974WI1930022FH",null,null,34,"WPS PPO HDHP Gold $3,750 OOS","81974WI1930049FH",0.7671,"Embedded HDHP","D/C",3750,"0%",3750,"D/C","D/C","D/C","D/C","D/C","D/C",7500,"30%",13500,"no cvrge","D/C","D/C","D/C",null,"D/C","Plan Deductible, then Coinsurance","Plan Deductible, then Coinsurance","(Embedded)",null,47,1.5629999999999999,{"$f":"ROUND(BA38*'Rating Formula'!$C$12,2)","v":{"$error":"#N/A"}},null,null,null,null,null,null,null,null,null,null,null,null,null,null,null,"LAFAYETTE",7,1.165,1.165,null,"WPS WI PPO HDHP Silver 1550 OOS","81974WI1930025FH",0.67949999999999999,0.67949999999999999]
[null,null,null,null,null,34,"MANITOWOC",null,null,null,null,"MANITOWOC",16,0.92800000000000005,null,"WPS PPO HDHP Gold $3,750 OOS",34,"WPS POS HDHP Gold $3,500","84670WI1350138","WPS PPO HDHP Gold $3,750 OOS","81974WI1930049FH",null,null,35,"WPS PPO HDHP Silver $2,500 OOS","81974WI1930023FH",0.63959999999999995,"Non-Embedded HDHP","D/C",2500,"30%",8000,"D/C","D/C","D/C","D/C","D/C","D/C",5000,"50%",15000,"no cvrge","D/C","D/C","D/C",null,"D/C","Plan Deductible, then Coinsurance","Plan Deductible, then Coinsurance","(Non-Embedded)",null,48,1.635,{"$f":"ROUND(BA39*'Rating Formula'!$C$12,2)","v":{"$error":"#N/A"}},null,null,null,null,null,null,null,null,null,null,null,null,null,null,null,"LANGLADE",13,1.135,1.135,null,"WPS WI PPO HDHP Silver 2500 OOS","81974WI1930023FH",0.63690000000000002,0.63690000000000002]
[null,null,null,null,null,35,"MARATHON",null,null,null,null,"MARATHON",10,0.97399999999999998,null,"WPS PPO HDHP Silver $2,500 OOS",35,"WPS POS HDHP Silver $2,500","84670WI1350116","WPS PPO HDHP Silver $2,500 OOS","81974WI1930023FH",null,null,36,"WPS PPO HDHP Silver $3,300 OOS","81974WI1930035FH",0.64510000000000001,"Embedded HDHP","D/C",3300,"20%",8300,"D/C","D/C","D/C","D/C","D/C","D/C",6600,"50%",16600,"no cvrge","D/C","D/C","D/C",null,"D/C","Plan Deductible, then Coinsurance","Plan Deductible, then Coinsurance","(Embedded)",null,49,1.706,{"$f":"ROUND(BA40*'Rating Formula'!$C$12,2)","v":{"$error":"#N/A"}},null,null,null,null,null,null,null,null,null,null,null,null,null,null,null,"LINCOLN",10,0.97399999999999998,0.97399999999999998,null,"WPS WI PPO HDHP Silver 2700 OOS","81974WI1930035FH",0.66059999999999997,0.66059999999999997]
[null,null,null,null,null,36,"MARINETTE",null,null,null,null,"MARINETTE",16,0.92800000000000005,null,"WPS PPO HDHP Silver $3,300 OOS",36,"WPS POS HDHP Silver $3,000","84670WI1350117","WPS PPO HDHP Silver $3,300 OOS","81974WI1930035FH",null,null,37,"WPS PPO HDHP Silver $3,500 OOS","81974WI1930050FH",0.64539999999999997,"Embedded HDHP","D/C",3500,"20%",8300,"D/C","D/C","D/C","D/C","D/C","D/C",7000,"50%",17000,"no cvrge","D/C","D/C","D/C",null,"D/C","Plan Deductible, then Coinsurance","Plan Deductible, then Coinsurance","(Embedded)",null,50,1.786,{"$f":"ROUND(BA41*'Rating Formula'!$C$12,2)","v":{"$error":"#N/A"}},null,null,null,null,null,null,null,null,null,null,null,null,null,null,null,"MANITOWOC",16,0.92800000000000005,0.92800000000000005,null,"WPS WI PPO HDHP Silver 3500 OOS","81974WI1930050FH",0.64500000000000002,0.64500000000000002]
[null,null,null,null,null,37,"MARQUETTE",null,null,null,null,"MARQUETTE",15,1.0980000000000001,null,"WPS PPO HDHP Silver $3,500 OOS",37,"WPS POS HDHP Silver $3,500","84670WI1350139","WPS PPO HDHP Silver $3,500 OOS","81974WI1930050FH",null,null,38,"WPS PPO HDHP Silver $4,000 OOS","81974WI1930025FH",0.62960000000000005,"Embedded HDHP","D/C",4000,"30%",7500,"D/C","D/C","D/C","D/C","D/C","D/C",8000,"50%",18000,"no cvrge","D/C","D/C","D/C",null,"D/C","Plan Deductible, then Coinsurance","Plan Deductible, then Coinsurance","(Embedded)",null,51,1.865,{"$f":"ROUND(BA42*'Rating Formula'!$C$12,2)","v":{"$error":"#N/A"}},null,null,null,null,null,null,null,null,null,null,null,null,null,null,null,"MARATHON",10,0.97399999999999998,0.97399999999999998,null,"WPS WI PPO HDHP Silver 3850 OOS","81974WI1930037FH",0.69420000000000004,0.69420000000000004]
[null,null,null,null,null,38,"MILWAUKEE",null,null,null,null,"MILWAUKEE",1,1.1830000000000001,null,"WPS PPO HDHP Silver $4,000 OOS",38,"WPS POS HDHP Silver $4,000","84670WI1350115","WPS PPO HDHP Silver $4,000 OOS","81974WI1930025FH",null,null,39,"WPS PPO HDHP Silver $5,100 OOS","81974WI1930037FH",0.66710000000000003,"Embedded HDHP","D/C",5100,"0%",5100,"D/C","D/C","D/C","D/C","D/C","D/C",10200,"30%",16200,"no cvrge","D/C","D/C","D/C",null,"D/C","Plan Deductible, then Coinsurance","Plan Deductible, then Coinsurance","(Embedded)",null,52,1.952,{"$f":"ROUND(BA43*'Rating Formula'!$C$12,2)","v":{"$error":"#N/A"}},null,null,null,null,null,null,null,null,null,null,null,null,null,null,null,"MARINETTE",16,0.92800000000000005,0.92800000000000005,null,"WPS WI PPO HDHP Bronze 5500 OOS","81974WI1930027FH",0.59909999999999997,0.59909999999999997]
[null,null,null,null,null,39,"MONROE",null,null,null,null,"MONROE",6,1.365,null,"WPS PPO HDHP Silver $5,100 OOS",39,"WPS POS HDHP Silver $4,800","84670WI1350120","WPS PPO HDHP Silver $5,100 OOS","81974WI1930037FH",null,null,40,"WPS PPO HDHP Silver $6,000 OOS","81974WI1930051FH",0.65039999999999998,"Embedded HDHP","D/C",6000,"0%",6000,"D/C","D/C","D/C","D/C","D/C","D/C",12000,"30%",18000,"no cvrge","D/C","D/C","D/C",null,"D/C","Plan Deductible, then Coinsurance","Plan Deductible, then Coinsurance","(Embedded)",null,53,2.04,{"$f":"ROUND(BA44*'Rating Formula'!$C$12,2)","v":{"$error":"#N/A"}},null,null,null,null,null,null,null,null,null,null,null,null,null,null,null,"MARQUETTE",15,1.0980000000000001,1.0980000000000001,null,"WPS WI PPO HDHP Bronze 6750 OOS","81974WI1930026FH",0.58560000000000001,0.58560000000000001]
[null,null,null,null,null,40,"OCONTO",null,null,null,null,"OCONTO",16,0.92800000000000005,null,"WPS PPO HDHP Silver $6,000 OOS",40,"WPS POS HDHP Silver $5,500","84670WI1350140","WPS PPO HDHP Silver $6,000 OOS","81974WI1930051FH",null,null,41,"WPS PPO HDHP Bronze $6,500 OOS","81974WI1930027FH",0.57720000000000005,"Embedded HDHP","D/C",6500,"30%",8300,"D/C","D/C","D/C","D/C","D/C","D/C",13000,"50%",23000,"no cvrge","D/C","D/C","D/C",null,"D/C","Plan Deductible, then Coinsurance","Plan Deductible, then Coinsurance","(Embedded)",null,54,2.1349999999999998,{"$f":"ROUND(BA45*'Rating Formula'!$C$12,2)","v":{"$error":"#N/A"}},null,null,null,null,null,null,null,null,null,null,null,null,null,null,null,"MILWAUKEE",1,1.2450000000000001,1.1830000000000001,null,"HMO Platinum 500 ","84670WI1330101",1.0488,0.99639999999999995]
[null,null,null,null,null,41,"ONEIDA",null,null,null,null,"ONEIDA",13,1.135,null,"WPS PPO HDHP Bronze $6,500 OOS",41,"WPS POS HDHP Bronze $6,000","84670WI1350122","WPS PPO HDHP Bronze $6,500 OOS","81974WI1930027FH",null,null,42,"WPS PPO HDHP Bronze $8,300 OOS","81974WI1930026FH",0.56279999999999997,"Embedded HDHP","D/C",8300,"0%",8300,"D/C","D/C","D/C","D/C","D/C","D/C",16600,"30%",22600,"no cvrge","D/C","D/C","D/C",null,"D/C","Plan Deductible, then Coinsurance","Plan Deductible, then Coinsurance","(Embedded)",null,55,2.23,{"$f":"ROUND(BA46*'Rating Formula'!$C$12,2)","v":{"$error":"#N/A"}},null,null,null,null,null,null,null,null,null,null,null,null,null,null,null,"MONROE",6,1.365,1.365,null,"HMO Gold 1000 ","84670WI1330102",0.86639999999999995,0.84470000000000001]
[null,null,null,null,null,42,"OUTAGAMIE",null,null,null,null,"OUTAGAMIE",11,0.97599999999999998,null,"WPS PPO HDHP Bronze $8,300 OOS",42,"WPS POS HDHP Bronze $7,500","84670WI1350123","WPS PPO HDHP Bronze $8,300 OOS","81974WI1930026FH",null,null,43,"WPS HMO Platinum $500","84670WI1330101",0.9869,"HMO Copay","Copay",500,"20%",2000,0,10,35,70,null,450,"no cvrge","no cvrge","no cvrge","no cvrge","no cvrge","no cvrge","no cvrge",null,450,"$0 Gnr Pref / $15 Gnr Non-Pref / $40 Brnd Pref / $70 Brnd Non-Pref / Spcl Plan Deductible, then Coinsurance","$0 / $15 / $40 / $70 / D/C"," ",null,56,2.3330000000000002,{"$f":"ROUND(BA47*'Rating Formula'!$C$12,2)","v":{"$error":"#N/A"}},null,null,null,null,null,null,null,null,null,null,null,null,null,null,null,"OCONTO",16,0.92800000000000005,0.92800000000000005,null,"HMO Gold 1500 ","84670WI1330104",0.84389999999999998,0.82279999999999998]
[null,null,null,null,null,43,"OZAUKEE",null,null,null,null,"OZAUKEE",12,1.129,null,null,43,{"$f":"R27&\" OOS\"","v":"WPS POS Platinum $500 OOS"},{"$f":"S27&\"FH\"","v":"84670WI1350101FH"},null,null,null,null,44,"WPS HMO Gold $1,000","84670WI1330102",0.82609999999999995,"HMO Copay","Copay",1000,"20%",7750,0,10,35,70,null,450,"no cvrge","no cvrge","no cvrge","no cvrge","no cvrge","no cvrge","no cvrge",null,450,"$0 Gnr Pref / $15 Gnr Non-Pref / $40 Brnd Pref / $70 Brnd Non-Pref / Spcl Plan Deductible, then Coinsurance","$0 / $15 / $40 / $70 / D/C"," ",null,57,2.4369999999999998,{"$f":"ROUND(BA48*'Rating Formula'!$C$12,2)","v":{"$error":"#N/A"}},null,null,null,null,null,null,null,null,null,null,null,null,null,null,null,"ONEIDA",13,1.135,1.135,null,"HMO Gold 2000 ","84670WI1330125",0.79959999999999998,0.77969999999999995]
[null,null,null,null,null,44,"PEPIN",null,null,null,null,"PEPIN",4,1.369,null,null,44,{"$f":"R28&\" OOS\"","v":"WPS POS Gold $1,000 OOS"},{"$f":"S28&\"FH\"","v":"84670WI1350102FH"},null,null,null,null,45,"WPS HMO Gold $1,500","84670WI1330104",0.81430000000000002,"HMO Copay","Copay",1500,"10%",9100,0,10,35,70,null,450,"no cvrge","no cvrge","no cvrge","no cvrge","no cvrge","no cvrge","no cvrge",null,450,"$0 Gnr Pref / $15 Gnr Non-Pref / $40 Brnd Pref / $70 Brnd Non-Pref / Spcl Plan Deductible, then Coinsurance","$0 / $15 / $40 / $70 / D/C"," ",null,58,2.548,{"$f":"ROUND(BA49*'Rating Formula'!$C$12,2)","v":{"$error":"#N/A"}},null,null,null,null,null,null,null,null,null,null,null,null,null,null,null,"OUTAGAMIE",11,0.97599999999999998,0.97599999999999998,null,"HMO Gold 2500 ","84670WI1330126",0.79110000000000003,0.77129999999999999]
[null,null,null,null,null,45,"PIERCE",null,null,null,null,"PIERCE",3,1.115,null,null,45,"WPS POS Gold $1,500 OOS","84670WI1350104FH",null,null,null,null,46,"WPS HMO Gold $2,000","84670WI1330125",0.78100000000000003,"HMO Copay","Copay",2000,"20%",8000,0,10,35,70,null,450,"no cvrge","no cvrge","no cvrge","no cvrge","no cvrge","no cvrge","no cvrge",null,450,"$0 Gnr Pref / $15 Gnr Non-Pref / $40 Brnd Pref / $70 Brnd Non-Pref / Spcl Plan Deductible, then Coinsurance","$0 / $15 / $40 / $70 / D/C"," ",null,59,2.6030000000000002,{"$f":"ROUND(BA50*'Rating Formula'!$C$12,2)","v":{"$error":"#N/A"}},null,null,null,null,null,null,null,null,null,null,null,null,null,null,null,"OZAUKEE",12,1.1879999999999999,1.129,null,"HMO Silver 3000 ","84670WI1330106",0.71709999999999996,0.71709999999999996]
[null,null,null,null,null,46,"POLK",null,null,null,null,"POLK",3,1.115,null,null,46,"WPS POS Gold $2,000 OOS","84670WI1350125FH",null,null,null,null,47,"WPS HMO Gold $2,500","84670WI1330126",0.79669999999999996,"HMO Copay","Copay",2500,"20%",5500,0,10,35,70,null,450,"no cvrge","no cvrge","no cvrge","no cvrge","no cvrge","no cvrge","no cvrge",null,450,"$0 Gnr Pref / $15 Gnr Non-Pref / $40 Brnd Pref / $70 Brnd Non-Pref / Spcl Plan Deductible, then Coinsurance","$0 / $15 / $40 / $70 / D/C",null,null,60,2.714,{"$f":"ROUND(BA51*'Rating Formula'!$C$12,2)","v":{"$error":"#N/A"}},null,null,null,null,null,null,null,null,null,null,null,null,null,null,null,"PEPIN",4,1.369,1.369,null,"HMO Silver 3500 ","84670WI1330107",0.72140000000000004,0.72140000000000004]
[null,null,null,null,null,47,"PORTAGE",null,null,null,null,"PORTAGE",10,0.97399999999999998,null,null,47,"WPS POS Gold $2,500 OOS","84670WI1350126FH",null,null,null,null,48,"WPS HMO Silver $5,000","84670WI1330106",0.69520000000000004,"HMO Copay","Copay",5000,"20%",9100,0,10,45,90,null,500,"no cvrge","no cvrge","no cvrge","no cvrge","no cvrge","no cvrge","no cvrge",null,500,"$0 Gnr Pref / $25 Gnr Non-Pref / $60 Brnd Pref / $100 Brnd Non-Pref / Spcl Plan Deductible, then Coinsurance","$0 / $25 / $60 / $100 / D/C"," ",null,61,2.81,{"$f":"ROUND(BA52*'Rating Formula'!$C$12,2)","v":{"$error":"#N/A"}},null,null,null,null,null,null,null,null,null,null,null,null,null,null,null,"PIERCE",3,1.115,1.115,null,"HMO Silver 4500 0% ","84670WI1330135",0.7571,0.7571]
[null,null,null,null,null,48,"PRICE",null,null,null,null,"PRICE",8,1.22,null,null,48,"WPS POS Silver $5,000 OOS","84670WI1350106FH",null,null,null,null,49,"WPS HMO Silver $5,500","84670WI1330136",0.68310000000000004,"HMO Copay","Copay",5500,"20%",9100,0,10,45,90,null,500,"no cvrge","no cvrge","no cvrge","no cvrge","no cvrge","no cvrge","no cvrge",null,500,"$0 Gnr Pref / $25 Gnr Non-Pref / $60 Brnd Pref / $100 Brnd Non-Pref / Spcl Plan Deductible, then Coinsurance","$0 / $25 / $60 / $100 / D/C"," ",null,62,2.8730000000000002,{"$f":"ROUND(BA53*'Rating Formula'!$C$12,2)","v":{"$error":"#N/A"}},null,null,null,null,null,null,null,null,null,null,null,null,null,null,null,"POLK",3,1.115,1.115,null,"HMO Silver 4500 20% ","84670WI1330128",0.69820000000000004,0.69820000000000004]
[null,null,null,null,null,49,"RACINE",null,null,null,null,"RACINE",9,1.131,null,null,49,"WPS POS Silver $5,500 OOS","84670WI1350136FH",null,null,null,null,50,"WPS HMO Silver $5,700","84670WI1330107",0.69499999999999995,"HMO Copay","Copay",5700,"10%",9100,0,10,45,90,null,500,"no cvrge","no cvrge","no cvrge","no cvrge","no cvrge","no cvrge","no cvrge",null,500,"$0 Gnr Pref / $25 Gnr Non-Pref / $60 Brnd Pref / $100 Brnd Non-Pref / Spcl Plan Deductible, then Coinsurance","$0 / $25 / $60 / $100 / D/C"," ",null,63,2.952,{"$f":"ROUND(BA54*'Rating Formula'!$C$12,2)","v":{"$error":"#N/A"}},null,null,null,null,null,null,null,null,null,null,null,null,null,null,null,"PORTAGE",10,0.97399999999999998,0.97399999999999998,null,"HMO Silver 5500 ","84670WI1330136",0.69169999999999998,0.69169999999999998]
[null,null,null,null,null,50,"RICHLAND",null,null,null,null,"RICHLAND",15,1.0980000000000001,null,null,50,"WPS POS Silver $5,700 OOS","84670WI1350107FH",null,null,null,null,51,"WPS HMO Silver $6,000","84670WI1330128",0.69189999999999996,"HMO Copay","Copay",6000,"20%",8500,0,10,45,90,null,500,"no cvrge","no cvrge","no cvrge","no cvrge","no cvrge","no cvrge","no cvrge",null,500,"$0 Gnr Pref / $25 Gnr Non-Pref / $60 Brnd Pref / $100 Brnd Non-Pref / Spcl Plan Deductible, then Coinsurance","$0 / $25 / $60 / $100 / D/C"," ",null,64,3,{"$f":"ROUND(BA55*'Rating Formula'!$C$12,2)","v":{"$error":"#N/A"}},null,null,null,null,null,null,null,null,null,null,null,null,null,null,null,"PRICE",8,1.22,1.22,null,"HMO Silver 6500 ","84670WI1330137",0.68789999999999996,0.68789999999999996]
[null,null,null,null,null,51,"ROCK",null,null,null,null,"ROCK",14,1.0449999999999999,null,null,51,"WPS POS Silver $6,000 OOS","84670WI1350128FH",null,null,null,null,52,"WPS HMO Silver $6,500","84670WI1330137",0.67500000000000004,"HMO Copay","Copay",6500,"30%",9100,0,10,45,90,null,500,"no cvrge","no cvrge","no cvrge","no cvrge","no cvrge","no cvrge","no cvrge",null,500,"$0 Gnr Pref / $25 Gnr Non-Pref / $60 Brnd Pref / $100 Brnd Non-Pref / Spcl Plan Deductible, then Coinsurance","$0 / $25 / $60 / $100 / D/C"," ",null,999,3,{"$f":"ROUND(BA56*'Rating Formula'!$C$12,2)","v":{"$error":"#N/A"}},null,null,null,null,null,null,null,null,null,null,null,null,null,null,null,"RACINE",9,1.1910000000000001,1.131,null,"HMO HDHP Gold 2000 ","84670WI1330114",0.88729999999999998,0.86519999999999997]
[null,null,null,null,null,52,"RUSK",null,null,null,null,"RUSK",8,1.22,null,null,52,"WPS POS Silver $6,500 OOS","84670WI1350137FH",null,null,null,null,53,"WPS HMO Silver $8,100","84670WI1330135",0.72299999999999998,"HMO Copay","Copay",8100,"0%",8100,0,10,45,90,null,500,"no cvrge","no cvrge","no cvrge","no cvrge","no cvrge","no cvrge","no cvrge",null,500,"$0 Gnr Pref / $25 Gnr Non-Pref / $60 Brnd Pref / $100 Brnd Non-Pref / Spcl Plan Deductible, then Coinsurance","$0 / $25 / $60 / $100 / D/C"," ",null,null,null,null,null,null,null,null,null,null,null,null,null,null,null,null,null,null,null,"RICHLAND",15,1.0980000000000001,1.0980000000000001,null,"HMO HDHP Gold 2800 ","84670WI1330138",0.8639,0.84240000000000004]
[null,null,null,null,null,53,"SAUK",null,null,null,null,"SAUK",15,1.0980000000000001,null,null,53,"WPS POS Silver $8,100 OOS","84670WI1350135FH",null,null,null,null,54,"WPS HMO HDHP Gold $2,600","84670WI1330114",0.8417,"HMO Non-Embedded HDHP","D/C",2600,"0%",2600,"D/C","D/C","D/C","D/C","D/C","D/C","no cvrge","no cvrge","no cvrge","no cvrge","no cvrge","no cvrge","no cvrge",null,"D/C","Plan Deductible, then Coinsurance","Plan Deductible, then Coinsurance","(Non-Embedded)",null,null,null,null,null,null,null,null,null,null,null,null,null,null,null,null,null,null,null,"ROCK",14,1.0449999999999999,1.0449999999999999,null,"HMO HDHP Silver 1550 ","84670WI1330115",0.69720000000000004,0.69720000000000004]
[null,null,null,null,null,54,"SAWYER",null,null,null,null,"SAWYER",5,1.2569999999999999,null,null,54,"WPS POS HDHP Gold $2,600 OOS","84670WI1350114FH",null,null,null,null,55,"WPS HMO HDHP Gold $3,500","84670WI1330138",0.82369999999999999,"HMO Embedded HDHP","D/C",3500,"0%",3500,"D/C","D/C","D/C","D/C","D/C","D/C","no cvrge","no cvrge","no cvrge","no cvrge","no cvrge","no cvrge","no cvrge",null,"D/C","Plan Deductible, then Coinsurance","Plan Deductible, then Coinsurance","(Embedded)",null,null,null,null,null,null,null,null,null,null,null,null,null,null,null,null,null,null,null,"RUSK",8,1.22,1.22,null,"HMO HDHP Silver 2500 ","84670WI1330116",0.65349999999999997,0.65349999999999997]
[null,null,null,null,null,55,"SHAWANO",null,null,null,null,"SHAWANO",16,0.92800000000000005,null,null,55,"WPS POS HDHP Gold $3,500 OOS","84670WI1350138FH",null,null,null,null,56,"WPS HMO HDHP Silver $2,500","84670WI1330116",0.6603,"HMO Non-Embedded HDHP","D/C",2500,"30%",7500,"D/C","D/C","D/C","D/C","D/C","D/C","no cvrge","no cvrge","no cvrge","no cvrge","no cvrge","no cvrge","no cvrge",null,"D/C","Plan Deductible, then Coinsurance","Plan Deductible, then Coinsurance","(Non-Embedded)",null,null,null,null,null,null,null,null,null,null,null,null,null,null,null,null,null,null,null,"SAUK",15,1.0980000000000001,1.0980000000000001,null,"HMO HDHP Silver 2700 ","84670WI1330117",0.67779999999999996,0.67779999999999996]
[null,null,null,null,null,56,"SHEBOYGAN",null,null,null,null,"SHEBOYGAN",11,0.97599999999999998,null,null,56,"WPS POS HDHP Silver $2,500 OOS","84670WI1350116FH",null,null,null,null,57,"WPS HMO HDHP Silver $3,000","84670WI1330117",0.67249999999999999,"HMO Embedded HDHP","D/C",3000,"20%",7500,"D/C","D/C","D/C","D/C","D/C","D/C","no cvrge","no cvrge","no cvrge","no cvrge","no cvrge","no cvrge","no cvrge",null,"D/C","Plan Deductible, then Coinsurance","Plan Deductible, then Coinsurance","(Embedded)",null,null,null,null,null,null,null,null,null,null,null,null,null,null,null,null,null,null,null,"SAWYER",5,1.2569999999999999,1.2569999999999999,null,"HMO HDHP Silver 3500 ","84670WI1330139",0.66169999999999995,0.66169999999999995]
[null,null,null,null,null,57,"ST. CROIX",null,null,null,null,"ST. CROIX",3,1.115,null,null,57,"WPS POS HDHP Silver $3,000 OOS","84670WI1350117FH",null,null,null,null,58,"WPS HMO HDHP Silver $3,500","84670WI1330139",0.68369999999999997,"HMO Embedded HDHP","D/C",3500,"20%",5750,"D/C","D/C","D/C","D/C","D/C","D/C","no cvrge","no cvrge","no cvrge","no cvrge","no cvrge","no cvrge","no cvrge",null,"D/C","Plan Deductible, then Coinsurance","Plan Deductible, then Coinsurance","(Embedded)",null,null,null,null,null,null,null,null,null,null,null,null,null,null,null,null,null,null,null,"SHAWANO",16,0.92800000000000005,0.92800000000000005,null,"HMO HDHP Silver 3850 ","84670WI1330120",0.71230000000000004,0.71230000000000004]
[null,null,null,null,null,58,"TAYLOR",null,null,null,null,"TAYLOR",8,1.22,null,null,58,"WPS POS HDHP Silver $3,500 OOS","84670WI1350139FH",null,null,null,null,59,"WPS HMO HDHP Silver $4,000","84670WI1330115",0.64939999999999998,"HMO Embedded HDHP","D/C",4000,"30%",7200,"D/C","D/C","D/C","D/C","D/C","D/C","no cvrge","no cvrge","no cvrge","no cvrge","no cvrge","no cvrge","no cvrge",null,"D/C","Plan Deductible, then Coinsurance","Plan Deductible, then Coinsurance","(Embedded)",null,null,null,null,null,null,null,null,null,null,null,null,null,null,null,null,null,null,null,"SHEBOYGAN",11,0.97599999999999998,0.97599999999999998,null,"HMO HDHP Bronze 5500 ","84670WI1330122",0.62519999999999998,0.62519999999999998]
[null,null,null,null,null,59,"TREMPEALEAU",null,null,null,null,"TREMPEALEAU",6,1.365,null,null,59,"WPS POS HDHP Silver $4,000 OOS","84670WI1350115FH",null,null,null,null,60,"WPS HMO HDHP Silver $4,800","84670WI1330120",0.69159999999999999,"HMO Embedded HDHP","D/C",4800,"0%",4800,"D/C","D/C","D/C","D/C","D/C","D/C","no cvrge","no cvrge","no cvrge","no cvrge","no cvrge","no cvrge","no cvrge",null,"D/C","Plan Deductible, then Coinsurance","Plan Deductible, then Coinsurance","(Embedded)",null,null,null,null,null,null,null,null,null,null,null,null,null,null,null,null,null,null,null,"ST. CROIX",3,1.115,1.115,null,"HMO HDHP Bronze 6750 ","84670WI1330123",0.61099999999999999,0.61099999999999999]
[null,null,null,null,null,60,"VERNON",null,null,null,null,"VERNON",7,1.165,null,null,60,"WPS POS HDHP Silver $4,800 OOS","84670WI1350120FH",null,null,null,null,61,"WPS HMO HDHP Silver $5,500","84670WI1330140",0.67789999999999995,"HMO Embedded HDHP","D/C",5500,"0%",5500,"D/C","D/C","D/C","D/C","D/C","D/C","no cvrge","no cvrge","no cvrge","no cvrge","no cvrge","no cvrge","no cvrge",null,"D/C","Plan Deductible, then Coinsurance","Plan Deductible, then Coinsurance","(Embedded)",null,null,null,null,null,null,null,null,null,null,null,null,null,null,null,null,null,null,null,"TAYLOR",8,1.22,1.22,null,"POS Platinum 500 ","84670WI1350101",1.1040000000000001,1.1274999999999999]
[null,null,null,null,null,61,"VILAS",null,null,null,null,"VILAS",13,1.135,null,null,61,"WPS POS HDHP Silver $5,500 OOS","84670WI1350140FH",null,null,null,null,62,"WPS HMO HDHP Bronze $6,000","84670WI1330122",0.61499999999999999,"HMO Embedded HDHP","D/C",6000,"30%",7500,"D/C","D/C","D/C","D/C","D/C","D/C","no cvrge","no cvrge","no cvrge","no cvrge","no cvrge","no cvrge","no cvrge",null,"D/C","Plan Deductible, then Coinsurance","Plan Deductible, then Coinsurance","(Embedded)",null,null,null,null,null,null,null,null,null,null,null,null,null,null,null,null,null,null,null,"TREMPEALEAU",6,1.365,1.365,null,"POS Gold 1000 ","84670WI1350102",0.91200000000000003,0.95589999999999997]
[null,null,null,null,null,62,"WALWORTH",null,null,null,null,"WALWORTH",14,1.0449999999999999,null,null,62,"WPS POS HDHP Bronze $6,000 OOS","84670WI1350122FH",null,null,null,null,63,"WPS HMO HDHP Bronze $7,500","84670WI1330123",0.60099999999999998,"HMO Embedded HDHP","D/C",7500,"0%",7500,"D/C","D/C","D/C","D/C","D/C","D/C","no cvrge","no cvrge","no cvrge","no cvrge","no cvrge","no cvrge","no cvrge",null,"D/C","Plan Deductible, then Coinsurance","Plan Deductible, then Coinsurance","(Embedded)",null,null,null,null,null,null,null,null,null,null,null,null,null,null,null,null,null,null,null,"VERNON",7,1.165,1.165,null,"POS Gold 1500 ","84670WI1350104",0.88829999999999998,0.93110000000000004]
[null,null,null,null,null,63,"WASHBURN",null,null,null,null,"WASHBURN",5,1.2569999999999999,null,null,63,"WPS POS HDHP Bronze $7,500 OOS","84670WI1350123FH",null,null,null,null,64,"WPS POS Platinum $500","84670WI1350101",1.2239,"POS Copay","Copay",500,"20%",2000,0,10,35,70,null,450,1000,"50%",11000,"no cvrge","D/C","D/C","D/C",null,450,"$0 Gnr Pref / $15 Gnr Non-Pref / $40 Brnd Pref / $70 Brnd Non-Pref / Spcl Plan Deductible, then Coinsurance","$0 / $15 / $40 / $70 / D/C"," ",null,null,null,null,null,null,null,null,null,null,null,null,null,null,null,null,null,null,null,"VILAS",13,1.135,1.135,null,"POS Gold 2000 ","84670WI1350125",0.8417,0.88229999999999997]
[null,null,null,null,null,64,"WASHINGTON",null,null,null,null,"WASHINGTON",12,1.129,null,null,null,null,null,null,null,null,null,65,"WPS POS Gold $1,000","84670WI1350102",1.0246,"POS Copay","Copay",1000,"20%",7750,0,10,35,70,null,450,2000,"50%",12000,"no cvrge","D/C","D/C","D/C",null,450,"$0 Gnr Pref / $15 Gnr Non-Pref / $40 Brnd Pref / $70 Brnd Non-Pref / Spcl Plan Deductible, then Coinsurance","$0 / $15 / $40 / $70 / D/C"," ",null,null,null,null,null,null,null,null,null,null,null,null,null,null,null,null,null,null,null,"WALWORTH",14,1.0449999999999999,1.0449999999999999,null,"POS Gold 2500 ","84670WI1350126",0.8327,0.87280000000000002]
[null,null,null,null,null,65,{"$f":"IF($B$4=\"WPS\",L70,IF(H70=\"\",\"\",H70))","v":"WAUPACA"},null,null,null,null,"WAUPACA",11,0.97599999999999998,null,null,null,null,null,null,null,null,null,66,"WPS POS Gold $1,500","84670WI1350104",1.01,"POS Copay","Copay",1500,"10%",9100,0,10,35,70,null,450,3000,"40%",11000,"no cvrge","D/C","D/C","D/C",null,450,"$0 Gnr Pref / $15 Gnr Non-Pref / $40 Brnd Pref / $70 Brnd Non-Pref / Spcl Plan Deductible, then Coinsurance","$0 / $15 / $40 / $70 / D/C"," ",null,null,null,null,null,null,null,null,null,null,null,null,null,null,null,null,null,null,null,"WASHBURN",5,1.2569999999999999,1.2569999999999999,null,"POS Silver 3000 ","84670WI1350106",0.75480000000000003,0.81140000000000001]
[null,null,null,null,null,66,"WAUSHARA",null,null,null,null,"WAUSHARA",11,0.97599999999999998,null,null,null,null,null,null,null,null,null,67,"WPS POS Gold $2,000","84670WI1350125",0.96860000000000002,"POS Copay","Copay",2000,"20%",8000,0,10,35,70,null,450,4000,"50%",14000,"no cvrge","D/C","D/C","D/C",null,450,"$0 Gnr Pref / $15 Gnr Non-Pref / $40 Brnd Pref / $70 Brnd Non-Pref / Spcl Plan Deductible, then Coinsurance","$0 / $15 / $40 / $70 / D/C"," ",null,null,null,null,null,null,null,null,null,null,null,null,null,null,null,null,null,null,null,"WASHINGTON",12,1.1879999999999999,1.129,null,"POS Silver 3500 ","84670WI1350107",0.75939999999999996,0.81640000000000001]
[null,null,null,null,null,{"$f":"1+F71","v":67},"WINNEBAGO",null,null,null,null,"WINNEBAGO",11,0.97599999999999998,null,null,null,null,null,null,null,null,null,68,"WPS POS Gold $2,500","84670WI1350126",0.98799999999999999,"POS Copay","Copay",2500,"20%",5500,0,10,35,70,null,450,5000,"50%",15000,"no cvrge","D/C","D/C","D/C",null,450,"$0 Gnr Pref / $15 Gnr Non-Pref / $40 Brnd Pref / $70 Brnd Non-Pref / Spcl Plan Deductible, then Coinsurance","$0 / $15 / $40 / $70 / D/C",null,null,null,null,null,null,null,null,null,null,null,null,null,null,null,null,null,null,null,null,"WAUKESHA",12,1.1879999999999999,1.129,null,"POS Silver 4500 0% ","84670WI1350135",0.79690000000000005,0.85670000000000002]
[null,null,null,null,null,68,"WOOD",null,null,null,null,"WOOD",10,0.97399999999999998,null,null,null,null,null,null,null,null,null,69,"WPS POS Silver $5,000","84670WI1350106",0.86219999999999997,"POS Copay","Copay",5000,"20%",9100,0,10,45,90,null,500,10000,"50%",20000,"no cvrge","D/C","D/C","D/C",null,500,"$0 Gnr Pref / $25 Gnr Non-Pref / $60 Brnd Pref / $100 Brnd Non-Pref / Spcl Plan Deductible, then Coinsurance","$0 / $25 / $60 / $100 / D/C"," ",null,null,null,null,null,null,null,null,null,null,null,null,null,null,null,null,null,null,null,"WAUPACA",11,0.97599999999999998,0.97599999999999998,null,"POS Silver 4500 20% ","84670WI1350128",0.7349,0.79]
[null,null,null,null,null,null,null,null,null,null,null,null,null,null,null,null,null,null,null,null,null,null,null,70,"WPS POS Silver $5,500","84670WI1350136",0.84709999999999996,"POS Copay","Copay",5500,"20%",9100,0,10,45,90,null,500,11000,"50%",21000,"no cvrge","D/C","D/C","D/C",null,500,"$0 Gnr Pref / $25 Gnr Non-Pref / $60 Brnd Pref / $100 Brnd Non-Pref / Spcl Plan Deductible, then Coinsurance","$0 / $25 / $60 / $100 / D/C"," ",null,null,null,null,null,null,null,null,null,null,null,null,null,null,null,null,null,null,null,"WAUSHARA",11,0.97599999999999998,0.97599999999999998,null,"POS Silver 5500 ","84670WI1350136",0.72809999999999997,0.78269999999999995]
[null,null,null,null,null,null,null,null,null,null,null,null,null,null,null,null,null,null,null,null,null,null,null,71,"WPS POS Silver $5,700","84670WI1350107",0.86199999999999999,"POS Copay","Copay",5700,"10%",9100,0,10,45,90,null,500,11400,"40%",19400,"no cvrge","D/C","D/C","D/C",null,500,"$0 Gnr Pref / $25 Gnr Non-Pref / $60 Brnd Pref / $100 Brnd Non-Pref / Spcl Plan Deductible, then Coinsurance","$0 / $25 / $60 / $100 / D/C"," ",null,null,null,null,null,null,null,null,null,null,null,null,null,null,null,null,null,null,null,"WINNEBAGO",11,0.97599999999999998,0.97599999999999998,null,"POS Silver 6500 ","84670WI1350137",0.72409999999999997,0.77839999999999998]
[null,null,null,null,null,null,null,null,null,null,null,null,null,null,null,null,null,null,null,null,null,null,null,72,"WPS POS Silver $6,000","84670WI1350128",0.85809999999999997,"POS Copay","Copay",6000,"20%",8500,0,10,45,90,null,500,12000,"50%",22000,"no cvrge","D/C","D/C","D/C",null,500,"$0 Gnr Pref / $25 Gnr Non-Pref / $60 Brnd Pref / $100 Brnd Non-Pref / Spcl Plan Deductible, then Coinsurance","$0 / $25 / $60 / $100 / D/C"," ",null,null,null,null,null,null,null,null,null,null,null,null,null,null,null,null,null,null,null,"WOOD",10,0.97399999999999998,0.97399999999999998,null,"POS HDHP Gold 2000 ","84670WI1350114",0.93400000000000005,0.97899999999999998]
[null,null,null,null,null,null,null,null,null,null,null,null,null,null,null,null,null,null,null,null,null,null,null,73,"WPS POS Silver $6,500","84670WI1350137",0.83709999999999996,"POS Copay","Copay",6500,"30%",9100,0,10,45,90,null,500,13000,"50%",23000,"no cvrge","D/C","D/C","D/C",null,500,"$0 Gnr Pref / $25 Gnr Non-Pref / $60 Brnd Pref / $100 Brnd Non-Pref / Spcl Plan Deductible, then Coinsurance","$0 / $25 / $60 / $100 / D/C"," ",null,null,null,null,null,null,null,null,null,null,null,null,null,null,null,null,null,null,null,null,null,null,null,null,"POS HDHP Gold 2800 ","84670WI1350138",0.90939999999999999,0.95320000000000005]
[null,null,null,null,null,null,null,null,null,null,null,null,null,null,null,null,null,null,null,null,null,null,null,74,"WPS POS Silver $8,100","84670WI1350135",0.89659999999999995,"POS Copay","Copay",8100,"0%",8100,0,10,45,90,null,500,16200,"30%",22200,"no cvrge","D/C","D/C","D/C",null,500,"$0 Gnr Pref / $25 Gnr Non-Pref / $60 Brnd Pref / $100 Brnd Non-Pref / Spcl Plan Deductible, then Coinsurance","$0 / $25 / $60 / $100 / D/C"," ",null,null,null,null,null,null,null,null,null,null,null,null,null,null,null,null,null,null,null,null,null,null,null,null,"POS HDHP Silver 1550 ","84670WI1350115",0.7339,0.78890000000000005]
[null,null,null,null,null,null,null,null,null,null,null,null,null,null,null,null,null,null,null,null,null,null,null,75,"WPS POS HDHP Gold $2,600","84670WI1350114",1.0439000000000001,"POS Non-Embedded HDHP","D/C",2600,"0%",2600,"D/C","D/C","D/C","D/C","D/C","D/C",5200,"30%",11200,"no cvrge","D/C","D/C","D/C",null,"D/C","Plan Deductible, then Coinsurance","Plan Deductible, then Coinsurance","(Non-Embedded)",null,null,null,null,null,null,null,null,null,null,null,null,null,null,null,null,null,null,null,null,null,null,null,null,"POS HDHP Silver 2500 ","84670WI1350116",0.68789999999999996,0.73950000000000005]
[null,null,null,null,null,null,null,null,null,null,null,null,null,null,null,null,null,null,null,null,null,null,null,76,"WPS POS HDHP Gold $3,500","84670WI1350138",1.0216000000000001,"POS Embedded HDHP","D/C",3500,"0%",3500,"D/C","D/C","D/C","D/C","D/C","D/C",7000,"30%",13000,"no cvrge","D/C","D/C","D/C",null,"D/C","Plan Deductible, then Coinsurance","Plan Deductible, then Coinsurance","(Embedded)",null,null,null,null,null,null,null,null,null,null,null,null,null,null,null,null,null,null,null,null,null,null,null,null,"POS HDHP Silver 2700 ","84670WI1350117",0.71350000000000002,0.76700000000000002]
[null,null,null,null,null,null,null,null,null,null,null,null,null,null,null,null,null,null,null,null,null,null,null,77,"WPS POS HDHP Silver $2,500","84670WI1350116",0.8054,"POS Non-Embedded HDHP","D/C",2500,"30%",7500,"D/C","D/C","D/C","D/C","D/C","D/C",5000,"50%",15000,"no cvrge","D/C","D/C","D/C",null,"D/C","Plan Deductible, then Coinsurance","Plan Deductible, then Coinsurance","(Non-Embedded)",null,null,null,null,null,null,null,null,null,null,null,null,null,null,null,null,null,null,null,null,null,null,null,null,"POS HDHP Silver 3500 ","84670WI1350139",0.69650000000000001,0.74870000000000003]
[null,null,null,null,null,null,null,null,null,null,null,null,null,null,null,null,null,null,null,null,null,null,null,78,"WPS POS HDHP Silver $3,000","84670WI1350117",0.83399999999999996,"POS Embedded HDHP","D/C",3000,"20%",7500,"D/C","D/C","D/C","D/C","D/C","D/C",6000,"50%",16000,"no cvrge","D/C","D/C","D/C",null,"D/C","Plan Deductible, then Coinsurance","Plan Deductible, then Coinsurance","(Embedded)",null,null,null,null,null,null,null,null,null,null,null,null,null,null,null,null,null,null,null,null,null,null,null,null,"POS HDHP Silver 3850 ","84670WI1350120",0.74980000000000002,0.80600000000000005]
[null,null,null,null,null,null,null,null,null,null,null,null,null,null,null,null,null,null,null,null,null,null,null,79,"WPS POS HDHP Silver $3,500","84670WI1350139",0.84799999999999998,"POS Embedded HDHP","D/C",3500,"20%",5750,"D/C","D/C","D/C","D/C","D/C","D/C",7000,"50%",17000,"no cvrge","D/C","D/C","D/C",null,"D/C","Plan Deductible, then Coinsurance","Plan Deductible, then Coinsurance","(Embedded)",null,null,null,null,null,null,null,null,null,null,null,null,null,null,null,null,null,null,null,null,null,null,null,null,"POS HDHP Bronze 5500 ","84670WI1350122",0.65810000000000002,0.70750000000000002]
[null,null,null,null,null,null,null,null,null,null,null,null,null,null,null,null,null,null,null,null,null,null,null,80,"WPS POS HDHP Silver $4,000","84670WI1350115",0.81899999999999995,"POS Embedded HDHP","D/C",4000,"30%",7200,"D/C","D/C","D/C","D/C","D/C","D/C",8000,"50%",18000,"no cvrge","D/C","D/C","D/C",null,"D/C","Plan Deductible, then Coinsurance","Plan Deductible, then Coinsurance","(Embedded)",null,null,null,null,null,null,null,null,null,null,null,null,null,null,null,null,null,null,null,null,null,null,null,null,"POS HDHP Bronze 6750 ","84670WI1350123",0.64319999999999999,0.69140000000000001]
[null,null,null,null,null,null,null,null,null,null,null,null,null,null,null,null,null,null,null,null,null,null,null,81,"WPS POS HDHP Silver $4,800","84670WI1350120",0.85770000000000002,"POS Embedded HDHP","D/C",4800,"0%",4800,"D/C","D/C","D/C","D/C","D/C","D/C",9600,"30%",15600,"no cvrge","D/C","D/C","D/C",null,"D/C","Plan Deductible, then Coinsurance","Plan Deductible, then Coinsurance","(Embedded)",null,null,null,null,null,null,null,null,null,null,null,null,null,null,null,null,null,null,null,null,null,null,null,null,"POS Platinum 500 OOS","84670WI1350101FH",1.1040000000000001,1.1274999999999999]
[null,null,null,null,null,null,null,null,null,null,null,null,null,null,null,null,null,null,null,null,null,null,null,82,"WPS POS HDHP Silver $5,500","84670WI1350140",0.84079999999999999,"POS Embedded HDHP","D/C",5500,"0%",5500,"D/C","D/C","D/C","D/C","D/C","D/C",11000,"30%",17000,"no cvrge","D/C","D/C","D/C",null,"D/C","Plan Deductible, then Coinsurance","Plan Deductible, then Coinsurance","(Embedded)",null,null,null,null,null,null,null,null,null,null,null,null,null,null,null,null,null,null,null,null,null,null,null,null,"POS Gold 1000 OOS","84670WI1350102FH",0.91200000000000003,0.95589999999999997]
[null,null,null,null,null,null,null,null,null,null,null,null,null,null,null,null,null,null,null,null,null,null,null,83,"WPS POS HDHP Bronze $6,000","84670WI1350122",0.76280000000000003,"POS Embedded HDHP","D/C",6000,"30%",7500,"D/C","D/C","D/C","D/C","D/C","D/C",12000,"50%",22000,"no cvrge","D/C","D/C","D/C",null,"D/C","Plan Deductible, then Coinsurance","Plan Deductible, then Coinsurance","(Embedded)",null,null,null,null,null,null,null,null,null,null,null,null,null,null,null,null,null,null,null,null,null,null,null,null,"POS Gold 1500 OOS","84670WI1350104FH",0.88829999999999998,0.93110000000000004]
[null,null,null,null,null,null,null,null,null,null,null,null,null,null,null,null,null,null,null,null,null,null,null,84,"WPS POS HDHP Bronze $7,500","84670WI1350123",0.74529999999999996,"POS Embedded HDHP","D/C",7500,"0%",7500,"D/C","D/C","D/C","D/C","D/C","D/C",15000,"30%",21000,"no cvrge","D/C","D/C","D/C",null,"D/C","Plan Deductible, then Coinsurance","Plan Deductible, then Coinsurance","(Embedded)",null,null,null,null,null,null,null,null,null,null,null,null,null,null,null,null,null,null,null,null,null,null,null,null,"POS Gold 2000 OOS","84670WI1350125FH",0.8417,0.88229999999999997]
[null,null,null,null,null,null,null,null,null,null,null,null,null,null,null,null,null,null,null,null,null,null,null,85,"WPS POS Platinum $500 OOS","84670WI1350101FH",1.2239,"POS Copay","Copay",500,"20%",2000,0,10,35,70,null,450,1000,"50%",11000,"no cvrge","D/C","D/C","D/C",null,450,"$0 Gnr Pref / $15 Gnr Non-Pref / $40 Brnd Pref / $70 Brnd Non-Pref / Spcl Plan Deductible, then Coinsurance","$0 / $15 / $40 / $70 / D/C"," ",null,null,null,null,null,null,null,null,null,null,null,null,null,null,null,null,null,null,null,null,null,null,null,null,"POS Gold 2500 OOS","84670WI1350126FH",0.8327,0.87280000000000002]
[null,null,null,null,null,null,null,null,null,null,null,null,null,null,null,null,null,null,null,null,null,null,null,86,"WPS POS Gold $1,000 OOS","84670WI1350102FH",1.0246,"POS Copay","Copay",1000,"20%",7750,0,10,35,70,null,450,2000,"50%",12000,"no cvrge","D/C","D/C","D/C",null,450,"$0 Gnr Pref / $15 Gnr Non-Pref / $40 Brnd Pref / $70 Brnd Non-Pref / Spcl Plan Deductible, then Coinsurance","$0 / $15 / $40 / $70 / D/C"," ",null,null,null,null,null,null,null,null,null,null,null,null,null,null,null,null,null,null,null,null,null,null,null,null,"POS Silver 3000 OOS","84670WI1350106FH",0.75480000000000003,0.81140000000000001]
[null,null,null,null,null,null,null,null,null,null,null,null,null,null,null,null,null,null,null,null,null,null,null,87,"WPS POS Gold $1,500 OOS","84670WI1350104FH",1.01,"POS Copay","Copay",1500,"10%",9100,0,10,35,70,null,450,3000,"40%",11000,"no cvrge","D/C","D/C","D/C",null,450,"$0 Gnr Pref / $15 Gnr Non-Pref / $40 Brnd Pref / $70 Brnd Non-Pref / Spcl Plan Deductible, then Coinsurance","$0 / $15 / $40 / $70 / D/C"," ",null,null,null,null,null,null,null,null,null,null,null,null,null,null,null,null,null,null,null,null,null,null,null,null,"POS Silver 3500 OOS","84670WI1350107FH",0.75939999999999996,0.81640000000000001]
[null,null,null,null,null,null,null,null,null,null,null,null,null,null,null,null,null,null,null,null,null,null,null,88,"WPS POS Gold $2,000 OOS","84670WI1350125FH",0.96860000000000002,"POS Copay","Copay",2000,"20%",8000,0,10,35,70,null,450,4000,"50%",14000,"no cvrge","D/C","D/C","D/C",null,450,"$0 Gnr Pref / $15 Gnr Non-Pref / $40 Brnd Pref / $70 Brnd Non-Pref / Spcl Plan Deductible, then Coinsurance","$0 / $15 / $40 / $70 / D/C"," ",null,null,null,null,null,null,null,null,null,null,null,null,null,null,null,null,null,null,null,null,null,null,null,null,"POS Silver 4500 0% OOS","84670WI1350135FH",0.79690000000000005,0.85670000000000002]
[null,null,null,null,null,null,null,null,null,null,null,null,null,null,null,null,null,null,null,null,null,null,null,89,"WPS POS Gold $2,500 OOS","84670WI1350126FH",0.98799999999999999,"POS Copay","Copay",2500,"20%",5500,0,10,35,70,null,450,5000,"50%",15000,"no cvrge","D/C","D/C","D/C",null,450,"$0 Gnr Pref / $15 Gnr Non-Pref / $40 Brnd Pref / $70 Brnd Non-Pref / Spcl Plan Deductible, then Coinsurance","$0 / $15 / $40 / $70 / D/C",null,null,null,null,null,null,null,null,null,null,null,null,null,null,null,null,null,null,null,null,null,null,null,null,null,"POS Silver 4500 20% OOS","84670WI1350128FH",0.7349,0.79]
[null,null,null,null,null,null,null,null,null,null,null,null,null,null,null,null,null,null,null,null,null,null,null,90,"WPS POS Silver $5,000 OOS","84670WI1350106FH",0.86219999999999997,"POS Copay","Copay",5000,"20%",9100,0,10,45,90,null,500,10000,"50%",20000,"no cvrge","D/C","D/C","D/C",null,500,"$0 Gnr Pref / $25 Gnr Non-Pref / $60 Brnd Pref / $100 Brnd Non-Pref / Spcl Plan Deductible, then Coinsurance","$0 / $25 / $60 / $100 / D/C"," ",null,null,null,null,null,null,null,null,null,null,null,null,null,null,null,null,null,null,null,null,null,null,null,null,"POS Silver 5500 OOS","84670WI1350136FH",0.72809999999999997,0.78269999999999995]
[null,null,null,null,null,null,null,null,null,null,null,null,null,null,null,null,null,null,null,null,null,null,null,91,"WPS POS Silver $5,500 OOS","84670WI1350136FH",0.84709999999999996,"POS Copay","Copay",5500,"20%",9100,0,10,45,90,null,500,11000,"50%",21000,"no cvrge","D/C","D/C","D/C",null,500,"$0 Gnr Pref / $25 Gnr Non-Pref / $60 Brnd Pref / $100 Brnd Non-Pref / Spcl Plan Deductible, then Coinsurance","$0 / $25 / $60 / $100 / D/C"," ",null,null,null,null,null,null,null,null,null,null,null,null,null,null,null,null,null,null,null,null,null,null,null,null,"POS Silver 6500 OOS","84670WI1350137FH",0.72409999999999997,0.77839999999999998]
[null,null,null,null,null,null,null,null,null,null,null,null,null,null,null,null,null,null,null,null,null,null,null,92,"WPS POS Silver $5,700 OOS","84670WI1350107FH",0.86199999999999999,"POS Copay","Copay",5700,"10%",9100,0,10,45,90,null,500,11400,"40%",19400,"no cvrge","D/C","D/C","D/C",null,500,"$0 Gnr Pref / $25 Gnr Non-Pref / $60 Brnd Pref / $100 Brnd Non-Pref / Spcl Plan Deductible, then Coinsurance","$0 / $25 / $60 / $100 / D/C"," ",null,null,null,null,null,null,null,null,null,null,null,null,null,null,null,null,null,null,null,null,null,null,null,null,"POS HDHP Gold 2000 OOS","84670WI1350114FH",0.93400000000000005,0.97899999999999998]
[null,null,null,null,null,null,null,null,null,null,null,null,null,null,null,null,null,null,null,null,null,null,null,93,"WPS POS Silver $6,000 OOS","84670WI1350128FH",0.85809999999999997,"POS Copay","Copay",6000,"20%",8500,0,10,45,90,null,500,12000,"50%",22000,"no cvrge","D/C","D/C","D/C",null,500,"$0 Gnr Pref / $25 Gnr Non-Pref / $60 Brnd Pref / $100 Brnd Non-Pref / Spcl Plan Deductible, then Coinsurance","$0 / $25 / $60 / $100 / D/C"," ",null,null,null,null,null,null,null,null,null,null,null,null,null,null,null,null,null,null,null,null,null,null,null,null,"POS HDHP Gold 2800 OOS","84670WI1350138FH",0.90939999999999999,0.95320000000000005]
[null,null,null,null,null,null,null,null,null,null,null,null,null,null,null,null,null,null,null,null,null,null,null,94,"WPS POS Silver $6,500 OOS","84670WI1350137FH",0.83709999999999996,"POS Copay","Copay",6500,"30%",9100,0,10,45,90,null,500,13000,"50%",23000,"no cvrge","D/C","D/C","D/C",null,500,"$0 Gnr Pref / $25 Gnr Non-Pref / $60 Brnd Pref / $100 Brnd Non-Pref / Spcl Plan Deductible, then Coinsurance","$0 / $25 / $60 / $100 / D/C"," ",null,null,null,null,null,null,null,null,null,null,null,null,null,null,null,null,null,null,null,null,null,null,null,null,"POS HDHP Silver 1550 OOS","84670WI1350115FH",0.7339,0.78890000000000005]
[null,null,null,null,null,null,null,null,null,null,null,null,null,null,null,null,null,null,null,null,null,null,null,95,"WPS POS Silver $8,100 OOS","84670WI1350135FH",0.89659999999999995,"POS Copay","Copay",8100,"0%",8100,0,10,45,90,null,500,16200,"30%",22200,"no cvrge","D/C","D/C","D/C",null,500,"$0 Gnr Pref / $25 Gnr Non-Pref / $60 Brnd Pref / $100 Brnd Non-Pref / Spcl Plan Deductible, then Coinsurance","$0 / $25 / $60 / $100 / D/C"," ",null,null,null,null,null,null,null,null,null,null,null,null,null,null,null,null,null,null,null,null,null,null,null,null,"POS HDHP Silver 2500 OOS","84670WI1350116FH",0.68789999999999996,0.73950000000000005]
[null,null,null,null,null,null,null,null,null,null,null,null,null,null,null,null,null,null,null,null,null,null,null,96,"WPS POS HDHP Gold $2,600 OOS","84670WI1350114FH",1.0439000000000001,"POS Non-Embedded HDHP","D/C",2600,"0%",2600,"D/C","D/C","D/C","D/C","D/C","D/C",5200,"30%",11200,"no cvrge","D/C","D/C","D/C",null,"D/C","Plan Deductible, then Coinsurance","Plan Deductible, then Coinsurance","(Non-Embedded)",null,null,null,null,null,null,null,null,null,null,null,null,null,null,null,null,null,null,null,null,null,null,null,null,"POS HDHP Silver 2700 OOS","84670WI1350117FH",0.71350000000000002,0.76700000000000002]
[null,null,null,null,null,null,null,null,null,null,null,null,null,null,null,null,null,null,null,null,null,null,null,97,"WPS POS HDHP Gold $3,500 OOS","84670WI1350138FH",1.0216000000000001,"POS Embedded HDHP","D/C",3500,"0%",3500,"D/C","D/C","D/C","D/C","D/C","D/C",7000,"30%",13000,"no cvrge","D/C","D/C","D/C",null,"D/C","Plan Deductible, then Coinsurance","Plan Deductible, then Coinsurance","(Embedded)",null,null,null,null,null,null,null,null,null,null,null,null,null,null,null,null,null,null,null,null,null,null,null,null,"POS HDHP Silver 3500 OOS","84670WI1350139FH",0.69650000000000001,0.74870000000000003]
[null,null,null,null,null,null,null,null,null,null,null,null,null,null,null,null,null,null,null,null,null,null,null,98,"WPS POS HDHP Silver $2,500 OOS","84670WI1350116FH",0.8054,"POS Non-Embedded HDHP","D/C",2500,"30%",7500,"D/C","D/C","D/C","D/C","D/C","D/C",5000,"50%",15000,"no cvrge","D/C","D/C","D/C",null,"D/C","Plan Deductible, then Coinsurance","Plan Deductible, then Coinsurance","(Non-Embedded)",null,null,null,null,null,null,null,null,null,null,null,null,null,null,null,null,null,null,null,null,null,null,null,null,"POS HDHP Silver 3850 OOS","84670WI1350120FH",0.74980000000000002,0.80600000000000005]
[null,null,null,null,null,null,null,null,null,null,null,null,null,null,null,null,null,null,null,null,null,null,null,99,"WPS POS HDHP Silver $3,000 OOS","84670WI1350117FH",0.83399999999999996,"POS Embedded HDHP","D/C",3000,"20%",7500,"D/C","D/C","D/C","D/C","D/C","D/C",6000,"50%",16000,"no cvrge","D/C","D/C","D/C",null,"D/C","Plan Deductible, then Coinsurance","Plan Deductible, then Coinsurance","(Embedded)",null,null,null,null,null,null,null,null,null,null,null,null,null,null,null,null,null,null,null,null,null,null,null,null,"POS HDHP Bronze 5500 OOS","84670WI1350122FH",0.65810000000000002,0.70750000000000002]
[null,null,null,null,null,null,null,null,null,null,null,null,null,null,null,null,null,null,null,null,null,null,null,100,"WPS POS HDHP Silver $3,500 OOS","84670WI1350139FH",0.84799999999999998,"POS Embedded HDHP","D/C",3500,"20%",5750,"D/C","D/C","D/C","D/C","D/C","D/C",7000,"50%",17000,"no cvrge","D/C","D/C","D/C",null,"D/C","Plan Deductible, then Coinsurance","Plan Deductible, then Coinsurance","(Embedded)",null,null,null,null,null,null,null,null,null,null,null,null,null,null,null,null,null,null,null,null,null,null,null,null,"POS HDHP Bronze 6750 OOS","84670WI1350123FH",0.64319999999999999,0.69140000000000001]
[null,null,null,null,null,null,null,null,null,null,null,null,null,null,null,null,null,null,null,null,null,null,null,101,"WPS POS HDHP Silver $4,000 OOS","84670WI1350115FH",0.81899999999999995,"POS Embedded HDHP","D/C",4000,"30%",7200,"D/C","D/C","D/C","D/C","D/C","D/C",8000,"50%",18000,"no cvrge","D/C","D/C","D/C",null,"D/C","Plan Deductible, then Coinsurance","Plan Deductible, then Coinsurance","(Embedded)"]
[null,null,null,null,null,null,null,null,null,null,null,null,null,null,null,null,null,null,null,null,null,null,null,102,"WPS POS HDHP Silver $4,800 OOS","84670WI1350120FH",0.85770000000000002,"POS Embedded HDHP","D/C",4800,"0%",4800,"D/C","D/C","D/C","D/C","D/C","D/C",9600,"30%",15600,"no cvrge","D/C","D/C","D/C",null,"D/C","Plan Deductible, then Coinsurance","Plan Deductible, then Coinsurance","(Embedded)"]
[null,null,null,null,null,null,null,null,null,null,null,null,null,null,null,null,null,null,null,null,null,null,null,103,"WPS POS HDHP Silver $5,500 OOS","84670WI1350140FH",0.84079999999999999,"POS Embedded HDHP","D/C",5500,"0%",5500,"D/C","D/C","D/C","D/C","D/C","D/C",11000,"30%",17000,"no cvrge","D/C","D/C","D/C",null,"D/C","Plan Deductible, then Coinsurance","Plan Deductible, then Coinsurance","(Embedded)"]
[null,null,null,null,null,null,null,null,null,null,null,null,null,null,null,null,null,null,null,null,null,null,null,104,"WPS POS HDHP Bronze $6,000 OOS","84670WI1350122FH",0.76280000000000003,"POS Embedded HDHP","D/C",6000,"30%",7500,"D/C","D/C","D/C","D/C","D/C","D/C",12000,"50%",22000,"no cvrge","D/C","D/C","D/C",null,"D/C","Plan Deductible, then Coinsurance","Plan Deductible, then Coinsurance","(Embedded)"]
[null,null,null,null,null,null,null,null,null,null,null,null,null,null,null,null,null,null,null,null,null,null,null,105,"WPS POS HDHP Bronze $7,500 OOS","84670WI1350123FH",0.74529999999999996,"POS Embedded HDHP","D/C",7500,"0%",7500,"D/C","D/C","D/C","D/C","D/C","D/C",15000,"30%",21000,"no cvrge","D/C","D/C","D/C",null,"D/C","Plan Deductible, then Coinsurance","Plan Deductible, then Coinsurance","(Embedded)"]

{"sheet":"Rating Formula","index":7,"n_rows":193,"n_cols":10,"rows_kept":193,"cut":false,"hidden":true,"merged":[[2,1,2,2]]}
[]
[null,null,null,null,null,null,null,null,null,"Member"]
[null,"Rating Formula",null,null,null,"WPS Health Plan",null,"WPS",null,"Rates    "]
[null,"Base Rate",{"$f":"IF(Tables!B4=\"WPS\",'Rating Formula'!H4,'Rating Formula'!F4)","v":999.92},null,null,786.41,null,999.92,1,{"$f":"IF(Input!T6=\"\",\"\",IF(Input!AG6>3,0,VLOOKUP(Input!$V6,Tables!$AZ$5:$BB$56,3,TRUE)))","v":""}]
[null,"Trend Factor",{"$f":"IF(Tables!B4=\"WPS\",'Rating Formula'!H5,'Rating Formula'!F5)","v":{"$error":"#N/A"}},null,null,{"$f":"Tables!C18","v":{"$error":"#N/A"}},null,{"$f":"Tables!C18","v":{"$error":"#N/A"}},2,{"$f":"IF(Input!T7=\"\",\"\",IF(Input!AG7>3,0,VLOOKUP(Input!$V7,Tables!$AZ$5:$BB$56,3,TRUE)))","v":""}]
[null,null,null,null,null,null,null,null,3,{"$f":"IF(Input!T8=\"\",\"\",IF(Input!AG8>3,0,VLOOKUP(Input!$V8,Tables!$AZ$5:$BB$56,3,TRUE)))","v":""}]
[null,"Trended Base Rate",{"$f":"IF(Tables!B4=\"WPS\",H7,F7)","v":{"$error":"#N/A"}},null,null,{"$f":"ROUND(F4*F5,2)","v":{"$error":"#N/A"}},null,{"$f":"ROUND(H4*H5,2)","v":{"$error":"#N/A"}},4,{"$f":"IF(Input!T9=\"\",\"\",IF(Input!AG9>3,0,VLOOKUP(Input!$V9,Tables!$AZ$5:$BB$56,3,TRUE)))","v":""}]
[null,"Benefit Factor",{"$f":"IF(Tables!B4=\"WPS\",'Rating Formula'!H8,'Rating Formula'!F8)","v":{"$error":"#N/A"}},null,null,{"$f":"VLOOKUP(Input!L13,Tables!Z5:AA109,2,FALSE)","v":{"$error":"#N/A"}},null,{"$f":"VLOOKUP(Input!L13,Tables!Z5:AA109,2,FALSE)","v":{"$error":"#N/A"}},5,{"$f":"IF(Input!T10=\"\",\"\",IF(Input!AG10>3,0,VLOOKUP(Input!$V10,Tables!$AZ$5:$BB$56,3,TRUE)))","v":""}]
[null,"Ntwrk incl in BenFact",{"$f":"IF(Tables!B4=\"WPS\",'Rating Formula'!H9,'Rating Formula'!F9)","v":1},"HMO Fx = 0.95",null,{"$f":"IF(LEFT(Input!E17,3)=\"HMO\",0.95,1)","v":1},null,1,6,{"$f":"IF(Input!T11=\"\",\"\",IF(Input!AG11>3,0,VLOOKUP(Input!$V11,Tables!$AZ$5:$BB$56,3,TRUE)))","v":""}]
[null,"Region Factor",{"$f":"IF(Tables!B4=\"WPS\",H10,F10)","v":{"$error":"#N/A"}},null,null,{"$f":"IF(Tables!B4=\"WPS\",\"-\",VLOOKUP(Input!E13,Tables!$H$6:$J$29,3,FALSE))","v":"-"},null,{"$f":"IF(Tables!B4=\"WPS Health Plan\",\"-\",VLOOKUP(Input!E13,Tables!$L$6:$N$76,3,FALSE))","v":{"$error":"#N/A"}},7,{"$f":"IF(Input!T12=\"\",\"\",IF(Input!AG12>3,0,VLOOKUP(Input!$V12,Tables!$AZ$5:$BB$56,3,TRUE)))","v":""}]
[null,null,null,null,null,null,null,null,8,{"$f":"IF(Input!T13=\"\",\"\",IF(Input!AG13>3,0,VLOOKUP(Input!$V13,Tables!$AZ$5:$BB$56,3,TRUE)))","v":""}]
[null,"Rate Before Age Factor",{"$f":"ROUND(ROUND(C7*C8,4)*C10,2)","v":{"$error":"#N/A"}},null,null,null,null,null,9,{"$f":"IF(Input!T14=\"\",\"\",IF(Input!AG14>3,0,VLOOKUP(Input!$V14,Tables!$AZ$5:$BB$56,3,TRUE)))","v":""}]
[null,null,null,null,null,null,null,null,10,{"$f":"IF(Input!T15=\"\",\"\",IF(Input!AG15>3,0,VLOOKUP(Input!$V15,Tables!$AZ$5:$BB$56,3,TRUE)))","v":""}]
[null,"Final Group Rate",{"$f":"SUM(J4:J193)","v":0},"displayed on Input tab",null,null,null,null,11,{"$f":"IF(Input!T16=\"\",\"\",IF(Input!AG16>3,0,VLOOKUP(Input!$V16,Tables!$AZ$5:$BB$56,3,TRUE)))","v":""}]
[null,null,null,null,null,null,null,null,12,{"$f":"IF(Input!T17=\"\",\"\",IF(Input!AG17>3,0,VLOOKUP(Input!$V17,Tables!$AZ$5:$BB$56,3,TRUE)))","v":""}]
[null,"Calc'd Age Factor",{"$f":"C14/C12","v":{"$error":"#N/A"}},null,null,null,null,null,13,{"$f":"IF(Input!T18=\"\",\"\",IF(Input!AG18>3,0,VLOOKUP(Input!$V18,Tables!$AZ$5:$BB$56,3,TRUE)))","v":""}]
[null,null,null,null,null,null,null,null,14,{"$f":"IF(Input!T19=\"\",\"\",IF(Input!AG19>3,0,VLOOKUP(Input!$V19,Tables!$AZ$5:$BB$56,3,TRUE)))","v":""}]
[null,null,null,null,null,null,null,null,15,{"$f":"IF(Input!T20=\"\",\"\",IF(Input!AG20>3,0,VLOOKUP(Input!$V20,Tables!$AZ$5:$BB$56,3,TRUE)))","v":""}]
[null,null,null,null,null,null,null,null,16,{"$f":"IF(Input!T21=\"\",\"\",IF(Input!AG21>3,0,VLOOKUP(Input!$V21,Tables!$AZ$5:$BB$56,3,TRUE)))","v":""}]
[null,null,null,null,null,null,null,null,17,{"$f":"IF(Input!T22=\"\",\"\",IF(Input!AG22>3,0,VLOOKUP(Input!$V22,Tables!$AZ$5:$BB$56,3,TRUE)))","v":""}]
[null,null,null,null,null,null,null,null,18,{"$f":"IF(Input!T23=\"\",\"\",IF(Input!AG23>3,0,VLOOKUP(Input!$V23,Tables!$AZ$5:$BB$56,3,TRUE)))","v":""}]
[null,null,null,null,null,null,null,null,19,{"$f":"IF(Input!T24=\"\",\"\",IF(Input!AG24>3,0,VLOOKUP(Input!$V24,Tables!$AZ$5:$BB$56,3,TRUE)))","v":""}]
[null,null,null,null,null,null,null,null,20,{"$f":"IF(Input!T25=\"\",\"\",IF(Input!AG25>3,0,VLOOKUP(Input!$V25,Tables!$AZ$5:$BB$56,3,TRUE)))","v":""}]
[null,null,null,null,null,null,null,null,21,{"$f":"IF(Input!T26=\"\",\"\",IF(Input!AG26>3,0,VLOOKUP(Input!$V26,Tables!$AZ$5:$BB$56,3,TRUE)))","v":""}]
[null,null,null,null,null,null,null,null,22,{"$f":"IF(Input!T27=\"\",\"\",IF(Input!AG27>3,0,VLOOKUP(Input!$V27,Tables!$AZ$5:$BB$56,3,TRUE)))","v":""}]
[null,null,null,null,null,null,null,null,23,{"$f":"IF(Input!T28=\"\",\"\",IF(Input!AG28>3,0,VLOOKUP(Input!$V28,Tables!$AZ$5:$BB$56,3,TRUE)))","v":""}]
[null,null,null,null,null,null,null,null,24,{"$f":"IF(Input!T29=\"\",\"\",IF(Input!AG29>3,0,VLOOKUP(Input!$V29,Tables!$AZ$5:$BB$56,3,TRUE)))","v":""}]
[null,null,null,null,null,null,null,null,25,{"$f":"IF(Input!T30=\"\",\"\",IF(Input!AG30>3,0,VLOOKUP(Input!$V30,Tables!$AZ$5:$BB$56,3,TRUE)))","v":""}]
[null,null,null,null,null,null,null,null,26,{"$f":"IF(Input!T31=\"\",\"\",IF(Input!AG31>3,0,VLOOKUP(Input!$V31,Tables!$AZ$5:$BB$56,3,TRUE)))","v":""}]
[null,null,null,null,null,null,null,null,27,{"$f":"IF(Input!T32=\"\",\"\",IF(Input!AG32>3,0,VLOOKUP(Input!$V32,Tables!$AZ$5:$BB$56,3,TRUE)))","v":""}]
[null,null,null,null,null,null,null,null,28,{"$f":"IF(Input!T33=\"\",\"\",IF(Input!AG33>3,0,VLOOKUP(Input!$V33,Tables!$AZ$5:$BB$56,3,TRUE)))","v":""}]
[null,null,null,null,null,null,null,null,29,{"$f":"IF(Input!T34=\"\",\"\",IF(Input!AG34>3,0,VLOOKUP(Input!$V34,Tables!$AZ$5:$BB$56,3,TRUE)))","v":""}]
[null,null,null,null,null,null,null,null,30,{"$f":"IF(Input!T35=\"\",\"\",IF(Input!AG35>3,0,VLOOKUP(Input!$V35,Tables!$AZ$5:$BB$56,3,TRUE)))","v":""}]
[null,null,null,null,null,null,null,null,31,{"$f":"IF(Input!T36=\"\",\"\",IF(Input!AG36>3,0,VLOOKUP(Input!$V36,Tables!$AZ$5:$BB$56,3,TRUE)))","v":""}]
[null,null,null,null,null,null,null,null,32,{"$f":"IF(Input!T37=\"\",\"\",IF(Input!AG37>3,0,VLOOKUP(Input!$V37,Tables!$AZ$5:$BB$56,3,TRUE)))","v":""}]
[null,null,null,null,null,null,null,null,33,{"$f":"IF(Input!T38=\"\",\"\",IF(Input!AG38>3,0,VLOOKUP(Input!$V38,Tables!$AZ$5:$BB$56,3,TRUE)))","v":""}]
[null,null,null,null,null,null,null,null,34,{"$f":"IF(Input!T39=\"\",\"\",IF(Input!AG39>3,0,VLOOKUP(Input!$V39,Tables!$AZ$5:$BB$56,3,TRUE)))","v":""}]
[null,null,null,null,null,null,null,null,35,{"$f":"IF(Input!T40=\"\",\"\",IF(Input!AG40>3,0,VLOOKUP(Input!$V40,Tables!$AZ$5:$BB$56,3,TRUE)))","v":""}]
[null,null,null,null,null,null,null,null,36,{"$f":"IF(Input!T41=\"\",\"\",IF(Input!AG41>3,0,VLOOKUP(Input!$V41,Tables!$AZ$5:$BB$56,3,TRUE)))","v":""}]
[null,null,null,null,null,null,null,null,37,{"$f":"IF(Input!T42=\"\",\"\",IF(Input!AG42>3,0,VLOOKUP(Input!$V42,Tables!$AZ$5:$BB$56,3,TRUE)))","v":""}]
[null,null,null,null,null,null,null,null,38,{"$f":"IF(Input!T43=\"\",\"\",IF(Input!AG43>3,0,VLOOKUP(Input!$V43,Tables!$AZ$5:$BB$56,3,TRUE)))","v":""}]
[null,null,null,null,null,null,null,null,39,{"$f":"IF(Input!T44=\"\",\"\",IF(Input!AG44>3,0,VLOOKUP(Input!$V44,Tables!$AZ$5:$BB$56,3,TRUE)))","v":""}]
[null,null,null,null,null,null,null,null,40,{"$f":"IF(Input!T45=\"\",\"\",IF(Input!AG45>3,0,VLOOKUP(Input!$V45,Tables!$AZ$5:$BB$56,3,TRUE)))","v":""}]
[null,null,null,null,null,null,null,null,41,{"$f":"IF(Input!T46=\"\",\"\",IF(Input!AG46>3,0,VLOOKUP(Input!$V46,Tables!$AZ$5:$BB$56,3,TRUE)))","v":""}]
[null,null,null,null,null,null,null,null,42,{"$f":"IF(Input!T47=\"\",\"\",IF(Input!AG47>3,0,VLOOKUP(Input!$V47,Tables!$AZ$5:$BB$56,3,TRUE)))","v":""}]
[null,null,null,null,null,null,null,null,43,{"$f":"IF(Input!T48=\"\",\"\",IF(Input!AG48>3,0,VLOOKUP(Input!$V48,Tables!$AZ$5:$BB$56,3,TRUE)))","v":""}]
[null,null,null,null,null,null,null,null,44,{"$f":"IF(Input!T49=\"\",\"\",IF(Input!AG49>3,0,VLOOKUP(Input!$V49,Tables!$AZ$5:$BB$56,3,TRUE)))","v":""}]
[null,null,null,null,null,null,null,null,45,{"$f":"IF(Input!T50=\"\",\"\",IF(Input!AG50>3,0,VLOOKUP(Input!$V50,Tables!$AZ$5:$BB$56,3,TRUE)))","v":""}]
[null,null,null,null,null,null,null,null,46,{"$f":"IF(Input!T51=\"\",\"\",IF(Input!AG51>3,0,VLOOKUP(Input!$V51,Tables!$AZ$5:$BB$56,3,TRUE)))","v":""}]
[null,null,null,null,null,null,null,null,47,{"$f":"IF(Input!T52=\"\",\"\",IF(Input!AG52>3,0,VLOOKUP(Input!$V52,Tables!$AZ$5:$BB$56,3,TRUE)))","v":""}]
[null,null,null,null,null,null,null,null,48,{"$f":"IF(Input!T53=\"\",\"\",IF(Input!AG53>3,0,VLOOKUP(Input!$V53,Tables!$AZ$5:$BB$56,3,TRUE)))","v":""}]
[null,null,null,null,null,null,null,null,49,{"$f":"IF(Input!T54=\"\",\"\",IF(Input!AG54>3,0,VLOOKUP(Input!$V54,Tables!$AZ$5:$BB$56,3,TRUE)))","v":""}]
[null,null,null,null,null,null,null,null,50,{"$f":"IF(Input!T55=\"\",\"\",IF(Input!AG55>3,0,VLOOKUP(Input!$V55,Tables!$AZ$5:$BB$56,3,TRUE)))","v":""}]
[null,null,null,null,null,null,null,null,51,{"$f":"IF(Input!T56=\"\",\"\",IF(Input!AG56>3,0,VLOOKUP(Input!$V56,Tables!$AZ$5:$BB$56,3,TRUE)))","v":""}]
[null,null,null,null,null,null,null,null,52,{"$f":"IF(Input!T57=\"\",\"\",IF(Input!AG57>3,0,VLOOKUP(Input!$V57,Tables!$AZ$5:$BB$56,3,TRUE)))","v":""}]
[null,null,null,null,null,null,null,null,53,{"$f":"IF(Input!T58=\"\",\"\",IF(Input!AG58>3,0,VLOOKUP(Input!$V58,Tables!$AZ$5:$BB$56,3,TRUE)))","v":""}]
[null,null,null,null,null,null,null,null,54,{"$f":"IF(Input!T59=\"\",\"\",IF(Input!AG59>3,0,VLOOKUP(Input!$V59,Tables!$AZ$5:$BB$56,3,TRUE)))","v":""}]
[null,null,null,null,null,null,null,null,55,{"$f":"IF(Input!T60=\"\",\"\",IF(Input!AG60>3,0,VLOOKUP(Input!$V60,Tables!$AZ$5:$BB$56,3,TRUE)))","v":""}]
[null,null,null,null,null,null,null,null,56,{"$f":"IF(Input!T61=\"\",\"\",IF(Input!AG61>3,0,VLOOKUP(Input!$V61,Tables!$AZ$5:$BB$56,3,TRUE)))","v":""}]
[null,null,null,null,null,null,null,null,57,{"$f":"IF(Input!T62=\"\",\"\",IF(Input!AG62>3,0,VLOOKUP(Input!$V62,Tables!$AZ$5:$BB$56,3,TRUE)))","v":""}]
[null,null,null,null,null,null,null,null,58,{"$f":"IF(Input!T63=\"\",\"\",IF(Input!AG63>3,0,VLOOKUP(Input!$V63,Tables!$AZ$5:$BB$56,3,TRUE)))","v":""}]
[null,null,null,null,null,null,null,null,59,{"$f":"IF(Input!T64=\"\",\"\",IF(Input!AG64>3,0,VLOOKUP(Input!$V64,Tables!$AZ$5:$BB$56,3,TRUE)))","v":""}]
[null,null,null,null,null,null,null,null,60,{"$f":"IF(Input!T65=\"\",\"\",IF(Input!AG65>3,0,VLOOKUP(Input!$V65,Tables!$AZ$5:$BB$56,3,TRUE)))","v":""}]
[null,null,null,null,null,null,null,null,61,{"$f":"IF(Input!T66=\"\",\"\",IF(Input!AG66>3,0,VLOOKUP(Input!$V66,Tables!$AZ$5:$BB$56,3,TRUE)))","v":""}]
[null,null,null,null,null,null,null,null,62,{"$f":"IF(Input!T67=\"\",\"\",IF(Input!AG67>3,0,VLOOKUP(Input!$V67,Tables!$AZ$5:$BB$56,3,TRUE)))","v":""}]
[null,null,null,null,null,null,null,null,63,{"$f":"IF(Input!T68=\"\",\"\",IF(Input!AG68>3,0,VLOOKUP(Input!$V68,Tables!$AZ$5:$BB$56,3,TRUE)))","v":""}]
[null,null,null,null,null,null,null,null,64,{"$f":"IF(Input!T69=\"\",\"\",IF(Input!AG69>3,0,VLOOKUP(Input!$V69,Tables!$AZ$5:$BB$56,3,TRUE)))","v":""}]
[null,null,null,null,null,null,null,null,65,{"$f":"IF(Input!T70=\"\",\"\",IF(Input!AG70>3,0,VLOOKUP(Input!$V70,Tables!$AZ$5:$BB$56,3,TRUE)))","v":""}]
[null,null,null,null,null,null,null,null,66,{"$f":"IF(Input!T71=\"\",\"\",IF(Input!AG71>3,0,VLOOKUP(Input!$V71,Tables!$AZ$5:$BB$56,3,TRUE)))","v":""}]
[null,null,null,null,null,null,null,null,67,{"$f":"IF(Input!T72=\"\",\"\",IF(Input!AG72>3,0,VLOOKUP(Input!$V72,Tables!$AZ$5:$BB$56,3,TRUE)))","v":""}]
[null,null,null,null,null,null,null,null,68,{"$f":"IF(Input!T73=\"\",\"\",IF(Input!AG73>3,0,VLOOKUP(Input!$V73,Tables!$AZ$5:$BB$56,3,TRUE)))","v":""}]
[null,null,null,null,null,null,null,null,69,{"$f":"IF(Input!T74=\"\",\"\",IF(Input!AG74>3,0,VLOOKUP(Input!$V74,Tables!$AZ$5:$BB$56,3,TRUE)))","v":""}]
[null,null,null,null,null,null,null,null,70,{"$f":"IF(Input!T75=\"\",\"\",IF(Input!AG75>3,0,VLOOKUP(Input!$V75,Tables!$AZ$5:$BB$56,3,TRUE)))","v":""}]
[null,null,null,null,null,null,null,null,71,{"$f":"IF(Input!T76=\"\",\"\",IF(Input!AG76>3,0,VLOOKUP(Input!$V76,Tables!$AZ$5:$BB$56,3,TRUE)))","v":""}]
[null,null,null,null,null,null,null,null,72,{"$f":"IF(Input!T77=\"\",\"\",IF(Input!AG77>3,0,VLOOKUP(Input!$V77,Tables!$AZ$5:$BB$56,3,TRUE)))","v":""}]
[null,null,null,null,null,null,null,null,73,{"$f":"IF(Input!T78=\"\",\"\",IF(Input!AG78>3,0,VLOOKUP(Input!$V78,Tables!$AZ$5:$BB$56,3,TRUE)))","v":""}]
[null,null,null,null,null,null,null,null,74,{"$f":"IF(Input!T79=\"\",\"\",IF(Input!AG79>3,0,VLOOKUP(Input!$V79,Tables!$AZ$5:$BB$56,3,TRUE)))","v":""}]
[null,null,null,null,null,null,null,null,75,{"$f":"IF(Input!T80=\"\",\"\",IF(Input!AG80>3,0,VLOOKUP(Input!$V80,Tables!$AZ$5:$BB$56,3,TRUE)))","v":""}]
[null,null,null,null,null,null,null,null,76,{"$f":"IF(Input!T81=\"\",\"\",IF(Input!AG81>3,0,VLOOKUP(Input!$V81,Tables!$AZ$5:$BB$56,3,TRUE)))","v":""}]
[null,null,null,null,null,null,null,null,77,{"$f":"IF(Input!T82=\"\",\"\",IF(Input!AG82>3,0,VLOOKUP(Input!$V82,Tables!$AZ$5:$BB$56,3,TRUE)))","v":""}]
[null,null,null,null,null,null,null,null,78,{"$f":"IF(Input!T83=\"\",\"\",IF(Input!AG83>3,0,VLOOKUP(Input!$V83,Tables!$AZ$5:$BB$56,3,TRUE)))","v":""}]
[null,null,null,null,null,null,null,null,79,{"$f":"IF(Input!T84=\"\",\"\",IF(Input!AG84>3,0,VLOOKUP(Input!$V84,Tables!$AZ$5:$BB$56,3,TRUE)))","v":""}]
[null,null,null,null,null,null,null,null,80,{"$f":"IF(Input!T85=\"\",\"\",IF(Input!AG85>3,0,VLOOKUP(Input!$V85,Tables!$AZ$5:$BB$56,3,TRUE)))","v":""}]
[null,null,null,null,null,null,null,null,81,{"$f":"IF(Input!T86=\"\",\"\",IF(Input!AG86>3,0,VLOOKUP(Input!$V86,Tables!$AZ$5:$BB$56,3,TRUE)))","v":""}]
[null,null,null,null,null,null,null,null,82,{"$f":"IF(Input!T87=\"\",\"\",IF(Input!AG87>3,0,VLOOKUP(Input!$V87,Tables!$AZ$5:$BB$56,3,TRUE)))","v":""}]
[null,null,null,null,null,null,null,null,83,{"$f":"IF(Input!T88=\"\",\"\",IF(Input!AG88>3,0,VLOOKUP(Input!$V88,Tables!$AZ$5:$BB$56,3,TRUE)))","v":""}]
[null,null,null,null,null,null,null,null,84,{"$f":"IF(Input!T89=\"\",\"\",IF(Input!AG89>3,0,VLOOKUP(Input!$V89,Tables!$AZ$5:$BB$56,3,TRUE)))","v":""}]
[null,null,null,null,null,null,null,null,85,{"$f":"IF(Input!T90=\"\",\"\",IF(Input!AG90>3,0,VLOOKUP(Input!$V90,Tables!$AZ$5:$BB$56,3,TRUE)))","v":""}]
[null,null,null,null,null,null,null,null,86,{"$f":"IF(Input!T91=\"\",\"\",IF(Input!AG91>3,0,VLOOKUP(Input!$V91,Tables!$AZ$5:$BB$56,3,TRUE)))","v":""}]
[null,null,null,null,null,null,null,null,87,{"$f":"IF(Input!T92=\"\",\"\",IF(Input!AG92>3,0,VLOOKUP(Input!$V92,Tables!$AZ$5:$BB$56,3,TRUE)))","v":""}]
[null,null,null,null,null,null,null,null,88,{"$f":"IF(Input!T93=\"\",\"\",IF(Input!AG93>3,0,VLOOKUP(Input!$V93,Tables!$AZ$5:$BB$56,3,TRUE)))","v":""}]
[null,null,null,null,null,null,null,null,89,{"$f":"IF(Input!T94=\"\",\"\",IF(Input!AG94>3,0,VLOOKUP(Input!$V94,Tables!$AZ$5:$BB$56,3,TRUE)))","v":""}]
[null,null,null,null,null,null,null,null,90,{"$f":"IF(Input!T95=\"\",\"\",IF(Input!AG95>3,0,VLOOKUP(Input!$V95,Tables!$AZ$5:$BB$56,3,TRUE)))","v":""}]
[null,null,null,null,null,null,null,null,91,{"$f":"IF(Input!T96=\"\",\"\",IF(Input!AG96>3,0,VLOOKUP(Input!$V96,Tables!$AZ$5:$BB$56,3,TRUE)))","v":""}]
[null,null,null,null,null,null,null,null,92,{"$f":"IF(Input!T97=\"\",\"\",IF(Input!AG97>3,0,VLOOKUP(Input!$V97,Tables!$AZ$5:$BB$56,3,TRUE)))","v":""}]
[null,null,null,null,null,null,null,null,93,{"$f":"IF(Input!T98=\"\",\"\",IF(Input!AG98>3,0,VLOOKUP(Input!$V98,Tables!$AZ$5:$BB$56,3,TRUE)))","v":""}]
[null,null,null,null,null,null,null,null,94,{"$f":"IF(Input!T99=\"\",\"\",IF(Input!AG99>3,0,VLOOKUP(Input!$V99,Tables!$AZ$5:$BB$56,3,TRUE)))","v":""}]
[null,null,null,null,null,null,null,null,95,{"$f":"IF(Input!T100=\"\",\"\",IF(Input!AG100>3,0,VLOOKUP(Input!$V100,Tables!$AZ$5:$BB$56,3,TRUE)))","v":""}]
[null,null,null,null,null,null,null,null,96,{"$f":"IF(Input!T101=\"\",\"\",IF(Input!AG101>3,0,VLOOKUP(Input!$V101,Tables!$AZ$5:$BB$56,3,TRUE)))","v":""}]
[null,null,null,null,null,null,null,null,97,{"$f":"IF(Input!T102=\"\",\"\",IF(Input!AG102>3,0,VLOOKUP(Input!$V102,Tables!$AZ$5:$BB$56,3,TRUE)))","v":""}]
[null,null,null,null,null,null,null,null,98,{"$f":"IF(Input!T103=\"\",\"\",IF(Input!AG103>3,0,VLOOKUP(Input!$V103,Tables!$AZ$5:$BB$56,3,TRUE)))","v":""}]
[null,null,null,null,null,null,null,null,99,{"$f":"IF(Input!T104=\"\",\"\",IF(Input!AG104>3,0,VLOOKUP(Input!$V104,Tables!$AZ$5:$BB$56,3,TRUE)))","v":""}]
[null,null,null,null,null,null,null,null,100,{"$f":"IF(Input!T105=\"\",\"\",IF(Input!AG105>3,0,VLOOKUP(Input!$V105,Tables!$AZ$5:$BB$56,3,TRUE)))","v":""}]
[null,null,null,null,null,null,null,null,101,{"$f":"IF(Input!T106=\"\",\"\",IF(Input!AG106>3,0,VLOOKUP(Input!$V106,Tables!$AZ$5:$BB$56,3,TRUE)))","v":""}]
[null,null,null,null,null,null,null,null,102,{"$f":"IF(Input!T107=\"\",\"\",IF(Input!AG107>3,0,VLOOKUP(Input!$V107,Tables!$AZ$5:$BB$56,3,TRUE)))","v":""}]
[null,null,null,null,null,null,null,null,103,{"$f":"IF(Input!T108=\"\",\"\",IF(Input!AG108>3,0,VLOOKUP(Input!$V108,Tables!$AZ$5:$BB$56,3,TRUE)))","v":""}]
[null,null,null,null,null,null,null,null,104,{"$f":"IF(Input!T109=\"\",\"\",IF(Input!AG109>3,0,VLOOKUP(Input!$V109,Tables!$AZ$5:$BB$56,3,TRUE)))","v":""}]
[null,null,null,null,null,null,null,null,105,{"$f":"IF(Input!T110=\"\",\"\",IF(Input!AG110>3,0,VLOOKUP(Input!$V110,Tables!$AZ$5:$BB$56,3,TRUE)))","v":""}]
[null,null,null,null,null,null,null,null,106,{"$f":"IF(Input!T111=\"\",\"\",IF(Input!AG111>3,0,VLOOKUP(Input!$V111,Tables!$AZ$5:$BB$56,3,TRUE)))","v":""}]
[null,null,null,null,null,null,null,null,107,{"$f":"IF(Input!T112=\"\",\"\",IF(Input!AG112>3,0,VLOOKUP(Input!$V112,Tables!$AZ$5:$BB$56,3,TRUE)))","v":""}]
[null,null,null,null,null,null,null,null,108,{"$f":"IF(Input!T113=\"\",\"\",IF(Input!AG113>3,0,VLOOKUP(Input!$V113,Tables!$AZ$5:$BB$56,3,TRUE)))","v":""}]
[null,null,null,null,null,null,null,null,109,{"$f":"IF(Input!T114=\"\",\"\",IF(Input!AG114>3,0,VLOOKUP(Input!$V114,Tables!$AZ$5:$BB$56,3,TRUE)))","v":""}]
[null,null,null,null,null,null,null,null,110,{"$f":"IF(Input!T115=\"\",\"\",IF(Input!AG115>3,0,VLOOKUP(Input!$V115,Tables!$AZ$5:$BB$56,3,TRUE)))","v":""}]
[null,null,null,null,null,null,null,null,111,{"$f":"IF(Input!T116=\"\",\"\",IF(Input!AG116>3,0,VLOOKUP(Input!$V116,Tables!$AZ$5:$BB$56,3,TRUE)))","v":""}]
[null,null,null,null,null,null,null,null,112,{"$f":"IF(Input!T117=\"\",\"\",IF(Input!AG117>3,0,VLOOKUP(Input!$V117,Tables!$AZ$5:$BB$56,3,TRUE)))","v":""}]
[null,null,null,null,null,null,null,null,113,{"$f":"IF(Input!T118=\"\",\"\",IF(Input!AG118>3,0,VLOOKUP(Input!$V118,Tables!$AZ$5:$BB$56,3,TRUE)))","v":""}]
[null,null,null,null,null,null,null,null,114,{"$f":"IF(Input!T119=\"\",\"\",IF(Input!AG119>3,0,VLOOKUP(Input!$V119,Tables!$AZ$5:$BB$56,3,TRUE)))","v":""}]
[null,null,null,null,null,null,null,null,115,{"$f":"IF(Input!T120=\"\",\"\",IF(Input!AG120>3,0,VLOOKUP(Input!$V120,Tables!$AZ$5:$BB$56,3,TRUE)))","v":""}]
[null,null,null,null,null,null,null,null,116,{"$f":"IF(Input!T121=\"\",\"\",IF(Input!AG121>3,0,VLOOKUP(Input!$V121,Tables!$AZ$5:$BB$56,3,TRUE)))","v":""}]
[null,null,null,null,null,null,null,null,117,{"$f":"IF(Input!T122=\"\",\"\",IF(Input!AG122>3,0,VLOOKUP(Input!$V122,Tables!$AZ$5:$BB$56,3,TRUE)))","v":""}]
[null,null,null,null,null,null,null,null,118,{"$f":"IF(Input!T123=\"\",\"\",IF(Input!AG123>3,0,VLOOKUP(Input!$V123,Tables!$AZ$5:$BB$56,3,TRUE)))","v":""}]
[null,null,null,null,null,null,null,null,119,{"$f":"IF(Input!T124=\"\",\"\",IF(Input!AG124>3,0,VLOOKUP(Input!$V124,Tables!$AZ$5:$BB$56,3,TRUE)))","v":""}]
[null,null,null,null,null,null,null,null,120,{"$f":"IF(Input!T125=\"\",\"\",IF(Input!AG125>3,0,VLOOKUP(Input!$V125,Tables!$AZ$5:$BB$56,3,TRUE)))","v":""}]
[null,null,null,null,null,null,null,null,121,{"$f":"IF(Input!T126=\"\",\"\",IF(Input!AG126>3,0,VLOOKUP(Input!$V126,Tables!$AZ$5:$BB$56,3,TRUE)))","v":""}]
[null,null,null,null,null,null,null,null,122,{"$f":"IF(Input!T127=\"\",\"\",IF(Input!AG127>3,0,VLOOKUP(Input!$V127,Tables!$AZ$5:$BB$56,3,TRUE)))","v":""}]
[null,null,null,null,null,null,null,null,123,{"$f":"IF(Input!T128=\"\",\"\",IF(Input!AG128>3,0,VLOOKUP(Input!$V128,Tables!$AZ$5:$BB$56,3,TRUE)))","v":""}]
[null,null,null,null,null,null,null,null,124,{"$f":"IF(Input!T129=\"\",\"\",IF(Input!AG129>3,0,VLOOKUP(Input!$V129,Tables!$AZ$5:$BB$56,3,TRUE)))","v":""}]
[null,null,null,null,null,null,null,null,125,{"$f":"IF(Input!T130=\"\",\"\",IF(Input!AG130>3,0,VLOOKUP(Input!$V130,Tables!$AZ$5:$BB$56,3,TRUE)))","v":""}]
[null,null,null,null,null,null,null,null,126,{"$f":"IF(Input!T131=\"\",\"\",IF(Input!AG131>3,0,VLOOKUP(Input!$V131,Tables!$AZ$5:$BB$56,3,TRUE)))","v":""}]
[null,null,null,null,null,null,null,null,127,{"$f":"IF(Input!T132=\"\",\"\",IF(Input!AG132>3,0,VLOOKUP(Input!$V132,Tables!$AZ$5:$BB$56,3,TRUE)))","v":""}]
[null,null,null,null,null,null,null,null,128,{"$f":"IF(Input!T133=\"\",\"\",IF(Input!AG133>3,0,VLOOKUP(Input!$V133,Tables!$AZ$5:$BB$56,3,TRUE)))","v":""}]
[null,null,null,null,null,null,null,null,129,{"$f":"IF(Input!T134=\"\",\"\",IF(Input!AG134>3,0,VLOOKUP(Input!$V134,Tables!$AZ$5:$BB$56,3,TRUE)))","v":""}]
[null,null,null,null,null,null,null,null,130,{"$f":"IF(Input!T135=\"\",\"\",IF(Input!AG135>3,0,VLOOKUP(Input!$V135,Tables!$AZ$5:$BB$56,3,TRUE)))","v":""}]
[null,null,null,null,null,null,null,null,131,{"$f":"IF(Input!T136=\"\",\"\",IF(Input!AG136>3,0,VLOOKUP(Input!$V136,Tables!$AZ$5:$BB$56,3,TRUE)))","v":""}]
[null,null,null,null,null,null,null,null,132,{"$f":"IF(Input!T137=\"\",\"\",IF(Input!AG137>3,0,VLOOKUP(Input!$V137,Tables!$AZ$5:$BB$56,3,TRUE)))","v":""}]
[null,null,null,null,null,null,null,null,133,{"$f":"IF(Input!T138=\"\",\"\",IF(Input!AG138>3,0,VLOOKUP(Input!$V138,Tables!$AZ$5:$BB$56,3,TRUE)))","v":""}]
[null,null,null,null,null,null,null,null,134,{"$f":"IF(Input!T139=\"\",\"\",IF(Input!AG139>3,0,VLOOKUP(Input!$V139,Tables!$AZ$5:$BB$56,3,TRUE)))","v":""}]
[null,null,null,null,null,null,null,null,135,{"$f":"IF(Input!T140=\"\",\"\",IF(Input!AG140>3,0,VLOOKUP(Input!$V140,Tables!$AZ$5:$BB$56,3,TRUE)))","v":""}]
[null,null,null,null,null,null,null,null,136,{"$f":"IF(Input!T141=\"\",\"\",IF(Input!AG141>3,0,VLOOKUP(Input!$V141,Tables!$AZ$5:$BB$56,3,TRUE)))","v":""}]
[null,null,null,null,null,null,null,null,137,{"$f":"IF(Input!T142=\"\",\"\",IF(Input!AG142>3,0,VLOOKUP(Input!$V142,Tables!$AZ$5:$BB$56,3,TRUE)))","v":""}]
[null,null,null,null,null,null,null,null,138,{"$f":"IF(Input!T143=\"\",\"\",IF(Input!AG143>3,0,VLOOKUP(Input!$V143,Tables!$AZ$5:$BB$56,3,TRUE)))","v":""}]
[null,null,null,null,null,null,null,null,139,{"$f":"IF(Input!T144=\"\",\"\",IF(Input!AG144>3,0,VLOOKUP(Input!$V144,Tables!$AZ$5:$BB$56,3,TRUE)))","v":""}]
[null,null,null,null,null,null,null,null,140,{"$f":"IF(Input!T145=\"\",\"\",IF(Input!AG145>3,0,VLOOKUP(Input!$V145,Tables!$AZ$5:$BB$56,3,TRUE)))","v":""}]
[null,null,null,null,null,null,null,null,141,{"$f":"IF(Input!T146=\"\",\"\",IF(Input!AG146>3,0,VLOOKUP(Input!$V146,Tables!$AZ$5:$BB$56,3,TRUE)))","v":""}]
[null,null,null,null,null,null,null,null,142,{"$f":"IF(Input!T147=\"\",\"\",IF(Input!AG147>3,0,VLOOKUP(Input!$V147,Tables!$AZ$5:$BB$56,3,TRUE)))","v":""}]
[null,null,null,null,null,null,null,null,143,{"$f":"IF(Input!T148=\"\",\"\",IF(Input!AG148>3,0,VLOOKUP(Input!$V148,Tables!$AZ$5:$BB$56,3,TRUE)))","v":""}]
[null,null,null,null,null,null,null,null,144,{"$f":"IF(Input!T149=\"\",\"\",IF(Input!AG149>3,0,VLOOKUP(Input!$V149,Tables!$AZ$5:$BB$56,3,TRUE)))","v":""}]
[null,null,null,null,null,null,null,null,145,{"$f":"IF(Input!T150=\"\",\"\",IF(Input!AG150>3,0,VLOOKUP(Input!$V150,Tables!$AZ$5:$BB$56,3,TRUE)))","v":""}]
[null,null,null,null,null,null,null,null,146,{"$f":"IF(Input!T151=\"\",\"\",IF(Input!AG151>3,0,VLOOKUP(Input!$V151,Tables!$AZ$5:$BB$56,3,TRUE)))","v":""}]
[null,null,null,null,null,null,null,null,147,{"$f":"IF(Input!T152=\"\",\"\",IF(Input!AG152>3,0,VLOOKUP(Input!$V152,Tables!$AZ$5:$BB$56,3,TRUE)))","v":""}]
[null,null,null,null,null,null,null,null,148,{"$f":"IF(Input!T153=\"\",\"\",IF(Input!AG153>3,0,VLOOKUP(Input!$V153,Tables!$AZ$5:$BB$56,3,TRUE)))","v":""}]
[null,null,null,null,null,null,null,null,149,{"$f":"IF(Input!T154=\"\",\"\",IF(Input!AG154>3,0,VLOOKUP(Input!$V154,Tables!$AZ$5:$BB$56,3,TRUE)))","v":""}]
[null,null,null,null,null,null,null,null,150,{"$f":"IF(Input!T155=\"\",\"\",IF(Input!AG155>3,0,VLOOKUP(Input!$V155,Tables!$AZ$5:$BB$56,3,TRUE)))","v":""}]
[null,null,null,null,null,null,null,null,151,{"$f":"IF(Input!T156=\"\",\"\",IF(Input!AG156>3,0,VLOOKUP(Input!$V156,Tables!$AZ$5:$BB$56,3,TRUE)))","v":""}]
[null,null,null,null,null,null,null,null,152,{"$f":"IF(Input!T157=\"\",\"\",IF(Input!AG157>3,0,VLOOKUP(Input!$V157,Tables!$AZ$5:$BB$56,3,TRUE)))","v":""}]
[null,null,null,null,null,null,null,null,153,{"$f":"IF(Input!T158=\"\",\"\",IF(Input!AG158>3,0,VLOOKUP(Input!$V158,Tables!$AZ$5:$BB$56,3,TRUE)))","v":""}]
[null,null,null,null,null,null,null,null,154,{"$f":"IF(Input!T159=\"\",\"\",IF(Input!AG159>3,0,VLOOKUP(Input!$V159,Tables!$AZ$5:$BB$56,3,TRUE)))","v":""}]
[null,null,null,null,null,null,null,null,155,{"$f":"IF(Input!T160=\"\",\"\",IF(Input!AG160>3,0,VLOOKUP(Input!$V160,Tables!$AZ$5:$BB$56,3,TRUE)))","v":""}]
[null,null,null,null,null,null,null,null,156,{"$f":"IF(Input!T161=\"\",\"\",IF(Input!AG161>3,0,VLOOKUP(Input!$V161,Tables!$AZ$5:$BB$56,3,TRUE)))","v":""}]
[null,null,null,null,null,null,null,null,157,{"$f":"IF(Input!T162=\"\",\"\",IF(Input!AG162>3,0,VLOOKUP(Input!$V162,Tables!$AZ$5:$BB$56,3,TRUE)))","v":""}]
[null,null,null,null,null,null,null,null,158,{"$f":"IF(Input!T163=\"\",\"\",IF(Input!AG163>3,0,VLOOKUP(Input!$V163,Tables!$AZ$5:$BB$56,3,TRUE)))","v":""}]
[null,null,null,null,null,null,null,null,159,{"$f":"IF(Input!T164=\"\",\"\",IF(Input!AG164>3,0,VLOOKUP(Input!$V164,Tables!$AZ$5:$BB$56,3,TRUE)))","v":""}]
[null,null,null,null,null,null,null,null,160,{"$f":"IF(Input!T165=\"\",\"\",IF(Input!AG165>3,0,VLOOKUP(Input!$V165,Tables!$AZ$5:$BB$56,3,TRUE)))","v":""}]
[null,null,null,null,null,null,null,null,161,{"$f":"IF(Input!T166=\"\",\"\",IF(Input!AG166>3,0,VLOOKUP(Input!$V166,Tables!$AZ$5:$BB$56,3,TRUE)))","v":""}]
[null,null,null,null,null,null,null,null,162,{"$f":"IF(Input!T167=\"\",\"\",IF(Input!AG167>3,0,VLOOKUP(Input!$V167,Tables!$AZ$5:$BB$56,3,TRUE)))","v":""}]
[null,null,null,null,null,null,null,null,163,{"$f":"IF(Input!T168=\"\",\"\",IF(Input!AG168>3,0,VLOOKUP(Input!$V168,Tables!$AZ$5:$BB$56,3,TRUE)))","v":""}]
[null,null,null,null,null,null,null,null,164,{"$f":"IF(Input!T169=\"\",\"\",IF(Input!AG169>3,0,VLOOKUP(Input!$V169,Tables!$AZ$5:$BB$56,3,TRUE)))","v":""}]
[null,null,null,null,null,null,null,null,165,{"$f":"IF(Input!T170=\"\",\"\",IF(Input!AG170>3,0,VLOOKUP(Input!$V170,Tables!$AZ$5:$BB$56,3,TRUE)))","v":""}]
[null,null,null,null,null,null,null,null,166,{"$f":"IF(Input!T171=\"\",\"\",IF(Input!AG171>3,0,VLOOKUP(Input!$V171,Tables!$AZ$5:$BB$56,3,TRUE)))","v":""}]
[null,null,null,null,null,null,null,null,167,{"$f":"IF(Input!T172=\"\",\"\",IF(Input!AG172>3,0,VLOOKUP(Input!$V172,Tables!$AZ$5:$BB$56,3,TRUE)))","v":""}]
[null,null,null,null,null,null,null,null,168,{"$f":"IF(Input!T173=\"\",\"\",IF(Input!AG173>3,0,VLOOKUP(Input!$V173,Tables!$AZ$5:$BB$56,3,TRUE)))","v":""}]
[null,null,null,null,null,null,null,null,169,{"$f":"IF(Input!T174=\"\",\"\",IF(Input!AG174>3,0,VLOOKUP(Input!$V174,Tables!$AZ$5:$BB$56,3,TRUE)))","v":""}]
[null,null,null,null,null,null,null,null,170,{"$f":"IF(Input!T175=\"\",\"\",IF(Input!AG175>3,0,VLOOKUP(Input!$V175,Tables!$AZ$5:$BB$56,3,TRUE)))","v":""}]
[null,null,null,null,null,null,null,null,171,{"$f":"IF(Input!T176=\"\",\"\",IF(Input!AG176>3,0,VLOOKUP(Input!$V176,Tables!$AZ$5:$BB$56,3,TRUE)))","v":""}]
[null,null,null,null,null,null,null,null,172,{"$f":"IF(Input!T177=\"\",\"\",IF(Input!AG177>3,0,VLOOKUP(Input!$V177,Tables!$AZ$5:$BB$56,3,TRUE)))","v":""}]
[null,null,null,null,null,null,null,null,173,{"$f":"IF(Input!T178=\"\",\"\",IF(Input!AG178>3,0,VLOOKUP(Input!$V178,Tables!$AZ$5:$BB$56,3,TRUE)))","v":""}]
[null,null,null,null,null,null,null,null,174,{"$f":"IF(Input!T179=\"\",\"\",IF(Input!AG179>3,0,VLOOKUP(Input!$V179,Tables!$AZ$5:$BB$56,3,TRUE)))","v":""}]
[null,null,null,null,null,null,null,null,175,{"$f":"IF(Input!T180=\"\",\"\",IF(Input!AG180>3,0,VLOOKUP(Input!$V180,Tables!$AZ$5:$BB$56,3,TRUE)))","v":""}]
[null,null,null,null,null,null,null,null,176,{"$f":"IF(Input!T181=\"\",\"\",IF(Input!AG181>3,0,VLOOKUP(Input!$V181,Tables!$AZ$5:$BB$56,3,TRUE)))","v":""}]
[null,null,null,null,null,null,null,null,177,{"$f":"IF(Input!T182=\"\",\"\",IF(Input!AG182>3,0,VLOOKUP(Input!$V182,Tables!$AZ$5:$BB$56,3,TRUE)))","v":""}]
[null,null,null,null,null,null,null,null,178,{"$f":"IF(Input!T183=\"\",\"\",IF(Input!AG183>3,0,VLOOKUP(Input!$V183,Tables!$AZ$5:$BB$56,3,TRUE)))","v":""}]
[null,null,null,null,null,null,null,null,179,{"$f":"IF(Input!T184=\"\",\"\",IF(Input!AG184>3,0,VLOOKUP(Input!$V184,Tables!$AZ$5:$BB$56,3,TRUE)))","v":""}]
[null,null,null,null,null,null,null,null,180,{"$f":"IF(Input!T185=\"\",\"\",IF(Input!AG185>3,0,VLOOKUP(Input!$V185,Tables!$AZ$5:$BB$56,3,TRUE)))","v":""}]
[null,null,null,null,null,null,null,null,181,{"$f":"IF(Input!T186=\"\",\"\",IF(Input!AG186>3,0,VLOOKUP(Input!$V186,Tables!$AZ$5:$BB$56,3,TRUE)))","v":""}]
[null,null,null,null,null,null,null,null,182,{"$f":"IF(Input!T187=\"\",\"\",IF(Input!AG187>3,0,VLOOKUP(Input!$V187,Tables!$AZ$5:$BB$56,3,TRUE)))","v":""}]
[null,null,null,null,null,null,null,null,183,{"$f":"IF(Input!T188=\"\",\"\",IF(Input!AG188>3,0,VLOOKUP(Input!$V188,Tables!$AZ$5:$BB$56,3,TRUE)))","v":""}]
[null,null,null,null,null,null,null,null,184,{"$f":"IF(Input!T189=\"\",\"\",IF(Input!AG189>3,0,VLOOKUP(Input!$V189,Tables!$AZ$5:$BB$56,3,TRUE)))","v":""}]
[null,null,null,null,null,null,null,null,185,{"$f":"IF(Input!T190=\"\",\"\",IF(Input!AG190>3,0,VLOOKUP(Input!$V190,Tables!$AZ$5:$BB$56,3,TRUE)))","v":""}]
[null,null,null,null,null,null,null,null,186,{"$f":"IF(Input!T191=\"\",\"\",IF(Input!AG191>3,0,VLOOKUP(Input!$V191,Tables!$AZ$5:$BB$56,3,TRUE)))","v":""}]
[null,null,null,null,null,null,null,null,187,{"$f":"IF(Input!T192=\"\",\"\",IF(Input!AG196>3,0,VLOOKUP(Input!$V192,Tables!$AZ$5:$BB$56,3,TRUE)))","v":""}]
[null,null,null,null,null,null,null,null,188,{"$f":"IF(Input!T193=\"\",\"\",IF(Input!AG197>3,0,VLOOKUP(Input!$V193,Tables!$AZ$5:$BB$56,3,TRUE)))","v":""}]
[null,null,null,null,null,null,null,null,189,{"$f":"IF(Input!T194=\"\",\"\",IF(Input!AG198>3,0,VLOOKUP(Input!$V194,Tables!$AZ$5:$BB$56,3,TRUE)))","v":""}]
[null,null,null,null,null,null,null,null,190,{"$f":"IF(Input!T195=\"\",\"\",IF(Input!AG199>3,0,VLOOKUP(Input!$V195,Tables!$AZ$5:$BB$56,3,TRUE)))","v":""}]

{"sheet":"Output for PDFs","index":8,"n_rows":204,"n_cols":20,"rows_kept":204,"cut":false,"hidden":true,"merged":[[1,1,1,5],[2,1,2,5]]}
[]
[null,{"$f":"'Group Rate Summary'!B2:G2","v":""}]
[null,{"$f":"'Group Rate Summary'!B3","v":"Effective "}]
[]
[null,{"$f":"IF(Tables!B4=\"WPS Health Plan\",\"WPS Health Plan\",\"WPS\")& \" Renewal Presentation\"","v":"WPS Renewal Presentation"}]
[null,{"$f":"'Group Rate Summary'!B6","v":"PLAN - WPS 0  (HIOS ID: )                   COUNTY: "}]
[null,{"$f":"'Group Rate Summary'!B7","v":{"$error":"#N/A"}}]
[null,{"$f":"'Group Rate Summary'!B8","v":{"$error":"#N/A"}}]
[]
[null,"Employee","Employee",null,"Coverage","Current",null,"Renewal","Rate"]
[null,"Number","Name","Age","Type","Rate   ",null,"Rate   ","Change",null,null,"Coverage Type Values:",1,2,4]
[]
[null,null,null,null,null,null,null,null,null,null,"EE","Name","age","age","age","Cov"]
[null,null,null,null,null,null,null,null,null,null,"#","e","e","s","d","Type",null,"Coverage Type Lookup"]
[null,{"$f":"IF(C15=\"\",\"\",K15)","v":""},{"$f":"L15","v":""},{"$f":"IF(M15=0,\"\",M15)","v":""},{"$f":"IF(P15=0,\"\",VLOOKUP(P15,$R$15:$T$21,3,FALSE))","v":""},null,null,null,null,null,1,{"$f":"IF(ISNA(VLOOKUP($K15&L$14,Input!AT6:AT195,1,FALSE)),\"\",VLOOKUP($K15&L$14,Input!AT6:AW195,4,FALSE))","v":""},{"$f":"IF(ISNA(VLOOKUP($K15&M$14,Input!AT6:AT195,1,FALSE)),0,VLOOKUP($K15&M$14,Input!AT6:AU195,2,FALSE))","v":0},{"$f":"IF(ISNA(VLOOKUP($K15&N$14,Input!AT6:AT195,1,FALSE)),0,VLOOKUP($K15&N$14,Input!AT6:AU195,2,FALSE))","v":0},{"$f":"IF(ISNA(VLOOKUP($K15&O$14,Input!AT6:AT195,1,FALSE)),0,1)","v":0},{"$f":"IF(M15=0,0,1)+IF(N15=0,0,2)+IF(O15=0,0,4)","v":0},null,1,"e only","Single"]
[null,"",{"$f":"L16","v":""},{"$f":"IF(M16=0,\"\",M16)","v":""},"",null,null,null,null,null,2,{"$f":"IF(ISNA(VLOOKUP($K16&L$14,Input!AT7:AT196,1,FALSE)),\"\",VLOOKUP($K16&L$14,Input!AT7:AW196,4,FALSE))","v":""},{"$f":"IF(ISNA(VLOOKUP($K16&M$14,Input!AT7:AT196,1,FALSE)),0,VLOOKUP($K16&M$14,Input!AT7:AU196,2,FALSE))","v":0},{"$f":"IF(ISNA(VLOOKUP($K16&N$14,Input!AT7:AT196,1,FALSE)),0,VLOOKUP($K16&N$14,Input!AT7:AU196,2,FALSE))","v":0},{"$f":"IF(ISNA(VLOOKUP($K16&O$14,Input!AT7:AT196,1,FALSE)),0,1)","v":0},{"$f":"IF(M16=0,0,1)+IF(N16=0,0,2)+IF(O16=0,0,4)","v":0},null,2,"s only","Single"]
[null,"","","","",null,null,null,null,null,3,{"$f":"IF(ISNA(VLOOKUP($K17&L$14,Input!AT8:AT197,1,FALSE)),\"\",VLOOKUP($K17&L$14,Input!AT8:AW197,4,FALSE))","v":""},{"$f":"IF(ISNA(VLOOKUP($K17&M$14,Input!AT8:AT197,1,FALSE)),0,VLOOKUP($K17&M$14,Input!AT8:AU197,2,FALSE))","v":0},{"$f":"IF(ISNA(VLOOKUP($K17&N$14,Input!AT8:AT197,1,FALSE)),0,VLOOKUP($K17&N$14,Input!AT8:AU197,2,FALSE))","v":0},{"$f":"IF(ISNA(VLOOKUP($K17&O$14,Input!AT8:AT197,1,FALSE)),0,1)","v":0},0,null,3,"es","Emp & Sps"]
[null,"","","","",null,null,null,null,null,4,{"$f":"IF(ISNA(VLOOKUP($K18&L$14,Input!AT9:AT198,1,FALSE)),\"\",VLOOKUP($K18&L$14,Input!AT9:AW198,4,FALSE))","v":""},{"$f":"IF(ISNA(VLOOKUP($K18&M$14,Input!AT9:AT198,1,FALSE)),0,VLOOKUP($K18&M$14,Input!AT9:AU198,2,FALSE))","v":0},{"$f":"IF(ISNA(VLOOKUP($K18&N$14,Input!AT9:AT198,1,FALSE)),0,VLOOKUP($K18&N$14,Input!AT9:AU198,2,FALSE))","v":0},{"$f":"IF(ISNA(VLOOKUP($K18&O$14,Input!AT9:AT198,1,FALSE)),0,1)","v":0},0,null,4,"dep only","Dep Only"]
[null,"","","","",null,null,null,null,null,5,{"$f":"IF(ISNA(VLOOKUP($K19&L$14,Input!AT10:AT199,1,FALSE)),\"\",VLOOKUP($K19&L$14,Input!AT10:AW199,4,FALSE))","v":""},{"$f":"IF(ISNA(VLOOKUP($K19&M$14,Input!AT10:AT199,1,FALSE)),0,VLOOKUP($K19&M$14,Input!AT10:AU199,2,FALSE))","v":0},{"$f":"IF(ISNA(VLOOKUP($K19&N$14,Input!AT10:AT199,1,FALSE)),0,VLOOKUP($K19&N$14,Input!AT10:AU199,2,FALSE))","v":0},{"$f":"IF(ISNA(VLOOKUP($K19&O$14,Input!AT10:AT199,1,FALSE)),0,1)","v":0},0,null,5,"ec","Emp & Dep"]
[null,"","","","",null,null,null,null,null,6,{"$f":"IF(ISNA(VLOOKUP($K20&L$14,Input!AT11:AT200,1,FALSE)),\"\",VLOOKUP($K20&L$14,Input!AT11:AW200,4,FALSE))","v":""},{"$f":"IF(ISNA(VLOOKUP($K20&M$14,Input!AT11:AT200,1,FALSE)),0,VLOOKUP($K20&M$14,Input!AT11:AU200,2,FALSE))","v":0},{"$f":"IF(ISNA(VLOOKUP($K20&N$14,Input!AT11:AT200,1,FALSE)),0,VLOOKUP($K20&N$14,Input!AT11:AU200,2,FALSE))","v":0},{"$f":"IF(ISNA(VLOOKUP($K20&O$14,Input!AT11:AT200,1,FALSE)),0,1)","v":0},0,null,6,"sps& chld","Sps & Dep"]
[null,"","","","",null,null,null,null,null,7,{"$f":"IF(ISNA(VLOOKUP($K21&L$14,Input!AT12:AT201,1,FALSE)),\"\",VLOOKUP($K21&L$14,Input!AT12:AW201,4,FALSE))","v":""},{"$f":"IF(ISNA(VLOOKUP($K21&M$14,Input!AT12:AT201,1,FALSE)),0,VLOOKUP($K21&M$14,Input!AT12:AU201,2,FALSE))","v":0},{"$f":"IF(ISNA(VLOOKUP($K21&N$14,Input!AT12:AT201,1,FALSE)),0,VLOOKUP($K21&N$14,Input!AT12:AU201,2,FALSE))","v":0},{"$f":"IF(ISNA(VLOOKUP($K21&O$14,Input!AT12:AT201,1,FALSE)),0,1)","v":0},0,null,7,"family","Family"]
[null,"","","","",null,null,null,null,null,8,{"$f":"IF(ISNA(VLOOKUP($K22&L$14,Input!AT13:AT202,1,FALSE)),\"\",VLOOKUP($K22&L$14,Input!AT13:AW202,4,FALSE))","v":""},{"$f":"IF(ISNA(VLOOKUP($K22&M$14,Input!AT13:AT202,1,FALSE)),0,VLOOKUP($K22&M$14,Input!AT13:AU202,2,FALSE))","v":0},{"$f":"IF(ISNA(VLOOKUP($K22&N$14,Input!AT13:AT202,1,FALSE)),0,VLOOKUP($K22&N$14,Input!AT13:AU202,2,FALSE))","v":0},{"$f":"IF(ISNA(VLOOKUP($K22&O$14,Input!AT13:AT202,1,FALSE)),0,1)","v":0},0]
[null,"","","","",null,null,null,null,null,9,{"$f":"IF(ISNA(VLOOKUP($K23&L$14,Input!AT14:AT202,1,FALSE)),\"\",VLOOKUP($K23&L$14,Input!AT14:AW202,4,FALSE))","v":""},{"$f":"IF(ISNA(VLOOKUP($K23&M$14,Input!AT14:AT202,1,FALSE)),0,VLOOKUP($K23&M$14,Input!AT14:AU202,2,FALSE))","v":0},{"$f":"IF(ISNA(VLOOKUP($K23&N$14,Input!AT14:AT202,1,FALSE)),0,VLOOKUP($K23&N$14,Input!AT14:AU202,2,FALSE))","v":0},{"$f":"IF(ISNA(VLOOKUP($K23&O$14,Input!AT14:AT202,1,FALSE)),0,1)","v":0},0]
[null,"","","","",null,null,null,null,null,10,{"$f":"IF(ISNA(VLOOKUP($K24&L$14,Input!AT15:AT202,1,FALSE)),\"\",VLOOKUP($K24&L$14,Input!AT15:AW202,4,FALSE))","v":""},{"$f":"IF(ISNA(VLOOKUP($K24&M$14,Input!AT15:AT202,1,FALSE)),0,VLOOKUP($K24&M$14,Input!AT15:AU202,2,FALSE))","v":0},{"$f":"IF(ISNA(VLOOKUP($K24&N$14,Input!AT15:AT202,1,FALSE)),0,VLOOKUP($K24&N$14,Input!AT15:AU202,2,FALSE))","v":0},{"$f":"IF(ISNA(VLOOKUP($K24&O$14,Input!AT15:AT202,1,FALSE)),0,1)","v":0},0]
[null,"","","","",null,null,null,null,null,11,{"$f":"IF(ISNA(VLOOKUP($K25&L$14,Input!AT16:AT202,1,FALSE)),\"\",VLOOKUP($K25&L$14,Input!AT16:AW202,4,FALSE))","v":""},{"$f":"IF(ISNA(VLOOKUP($K25&M$14,Input!AT16:AT202,1,FALSE)),0,VLOOKUP($K25&M$14,Input!AT16:AU202,2,FALSE))","v":0},{"$f":"IF(ISNA(VLOOKUP($K25&N$14,Input!AT16:AT202,1,FALSE)),0,VLOOKUP($K25&N$14,Input!AT16:AU202,2,FALSE))","v":0},{"$f":"IF(ISNA(VLOOKUP($K25&O$14,Input!AT16:AT202,1,FALSE)),0,1)","v":0},0]
[null,"","","","",null,null,null,null,null,12,{"$f":"IF(ISNA(VLOOKUP($K26&L$14,Input!AT17:AT202,1,FALSE)),\"\",VLOOKUP($K26&L$14,Input!AT17:AW202,4,FALSE))","v":""},{"$f":"IF(ISNA(VLOOKUP($K26&M$14,Input!AT17:AT202,1,FALSE)),0,VLOOKUP($K26&M$14,Input!AT17:AU202,2,FALSE))","v":0},{"$f":"IF(ISNA(VLOOKUP($K26&N$14,Input!AT17:AT202,1,FALSE)),0,VLOOKUP($K26&N$14,Input!AT17:AU202,2,FALSE))","v":0},{"$f":"IF(ISNA(VLOOKUP($K26&O$14,Input!AT17:AT202,1,FALSE)),0,1)","v":0},0]
[null,"","","","",null,null,null,null,null,13,{"$f":"IF(ISNA(VLOOKUP($K27&L$14,Input!AT18:AT202,1,FALSE)),\"\",VLOOKUP($K27&L$14,Input!AT18:AW202,4,FALSE))","v":""},{"$f":"IF(ISNA(VLOOKUP($K27&M$14,Input!AT18:AT202,1,FALSE)),0,VLOOKUP($K27&M$14,Input!AT18:AU202,2,FALSE))","v":0},{"$f":"IF(ISNA(VLOOKUP($K27&N$14,Input!AT18:AT202,1,FALSE)),0,VLOOKUP($K27&N$14,Input!AT18:AU202,2,FALSE))","v":0},{"$f":"IF(ISNA(VLOOKUP($K27&O$14,Input!AT18:AT202,1,FALSE)),0,1)","v":0},0]
[null,"","","","",null,null,null,null,null,14,{"$f":"IF(ISNA(VLOOKUP($K28&L$14,Input!AT19:AT202,1,FALSE)),\"\",VLOOKUP($K28&L$14,Input!AT19:AW202,4,FALSE))","v":""},{"$f":"IF(ISNA(VLOOKUP($K28&M$14,Input!AT19:AT202,1,FALSE)),0,VLOOKUP($K28&M$14,Input!AT19:AU202,2,FALSE))","v":0},{"$f":"IF(ISNA(VLOOKUP($K28&N$14,Input!AT19:AT202,1,FALSE)),0,VLOOKUP($K28&N$14,Input!AT19:AU202,2,FALSE))","v":0},{"$f":"IF(ISNA(VLOOKUP($K28&O$14,Input!AT19:AT202,1,FALSE)),0,1)","v":0},0]
[null,"","","","",null,null,null,null,null,15,{"$f":"IF(ISNA(VLOOKUP($K29&L$14,Input!AT20:AT202,1,FALSE)),\"\",VLOOKUP($K29&L$14,Input!AT20:AW202,4,FALSE))","v":""},{"$f":"IF(ISNA(VLOOKUP($K29&M$14,Input!AT20:AT202,1,FALSE)),0,VLOOKUP($K29&M$14,Input!AT20:AU202,2,FALSE))","v":0},{"$f":"IF(ISNA(VLOOKUP($K29&N$14,Input!AT20:AT202,1,FALSE)),0,VLOOKUP($K29&N$14,Input!AT20:AU202,2,FALSE))","v":0},{"$f":"IF(ISNA(VLOOKUP($K29&O$14,Input!AT20:AT202,1,FALSE)),0,1)","v":0},0]
[null,"","","","",null,null,null,null,null,16,{"$f":"IF(ISNA(VLOOKUP($K30&L$14,Input!AT21:AT202,1,FALSE)),\"\",VLOOKUP($K30&L$14,Input!AT21:AW202,4,FALSE))","v":""},{"$f":"IF(ISNA(VLOOKUP($K30&M$14,Input!AT21:AT202,1,FALSE)),0,VLOOKUP($K30&M$14,Input!AT21:AU202,2,FALSE))","v":0},{"$f":"IF(ISNA(VLOOKUP($K30&N$14,Input!AT21:AT202,1,FALSE)),0,VLOOKUP($K30&N$14,Input!AT21:AU202,2,FALSE))","v":0},{"$f":"IF(ISNA(VLOOKUP($K30&O$14,Input!AT21:AT202,1,FALSE)),0,1)","v":0},0]
[null,"","","","",null,null,null,null,null,17,{"$f":"IF(ISNA(VLOOKUP($K31&L$14,Input!AT22:AT202,1,FALSE)),\"\",VLOOKUP($K31&L$14,Input!AT22:AW202,4,FALSE))","v":""},{"$f":"IF(ISNA(VLOOKUP($K31&M$14,Input!AT22:AT202,1,FALSE)),0,VLOOKUP($K31&M$14,Input!AT22:AU202,2,FALSE))","v":0},{"$f":"IF(ISNA(VLOOKUP($K31&N$14,Input!AT22:AT202,1,FALSE)),0,VLOOKUP($K31&N$14,Input!AT22:AU202,2,FALSE))","v":0},{"$f":"IF(ISNA(VLOOKUP($K31&O$14,Input!AT22:AT202,1,FALSE)),0,1)","v":0},0]
[null,"","","","",null,null,null,null,null,18,{"$f":"IF(ISNA(VLOOKUP($K32&L$14,Input!AT23:AT202,1,FALSE)),\"\",VLOOKUP($K32&L$14,Input!AT23:AW202,4,FALSE))","v":""},{"$f":"IF(ISNA(VLOOKUP($K32&M$14,Input!AT23:AT202,1,FALSE)),0,VLOOKUP($K32&M$14,Input!AT23:AU202,2,FALSE))","v":0},{"$f":"IF(ISNA(VLOOKUP($K32&N$14,Input!AT23:AT202,1,FALSE)),0,VLOOKUP($K32&N$14,Input!AT23:AU202,2,FALSE))","v":0},{"$f":"IF(ISNA(VLOOKUP($K32&O$14,Input!AT23:AT202,1,FALSE)),0,1)","v":0},0]
[null,"","","","",null,null,null,null,null,19,{"$f":"IF(ISNA(VLOOKUP($K33&L$14,Input!AT24:AT202,1,FALSE)),\"\",VLOOKUP($K33&L$14,Input!AT24:AW202,4,FALSE))","v":""},{"$f":"IF(ISNA(VLOOKUP($K33&M$14,Input!AT24:AT202,1,FALSE)),0,VLOOKUP($K33&M$14,Input!AT24:AU202,2,FALSE))","v":0},{"$f":"IF(ISNA(VLOOKUP($K33&N$14,Input!AT24:AT202,1,FALSE)),0,VLOOKUP($K33&N$14,Input!AT24:AU202,2,FALSE))","v":0},{"$f":"IF(ISNA(VLOOKUP($K33&O$14,Input!AT24:AT202,1,FALSE)),0,1)","v":0},0]
[null,"","","","",null,null,null,null,null,20,{"$f":"IF(ISNA(VLOOKUP($K34&L$14,Input!AT25:AT202,1,FALSE)),\"\",VLOOKUP($K34&L$14,Input!AT25:AW202,4,FALSE))","v":""},{"$f":"IF(ISNA(VLOOKUP($K34&M$14,Input!AT25:AT202,1,FALSE)),0,VLOOKUP($K34&M$14,Input!AT25:AU202,2,FALSE))","v":0},{"$f":"IF(ISNA(VLOOKUP($K34&N$14,Input!AT25:AT202,1,FALSE)),0,VLOOKUP($K34&N$14,Input!AT25:AU202,2,FALSE))","v":0},{"$f":"IF(ISNA(VLOOKUP($K34&O$14,Input!AT25:AT202,1,FALSE)),0,1)","v":0},0]
[null,"","","","",null,null,null,null,null,21,{"$f":"IF(ISNA(VLOOKUP($K35&L$14,Input!AT26:AT202,1,FALSE)),\"\",VLOOKUP($K35&L$14,Input!AT26:AW202,4,FALSE))","v":""},{"$f":"IF(ISNA(VLOOKUP($K35&M$14,Input!AT26:AT202,1,FALSE)),0,VLOOKUP($K35&M$14,Input!AT26:AU202,2,FALSE))","v":0},{"$f":"IF(ISNA(VLOOKUP($K35&N$14,Input!AT26:AT202,1,FALSE)),0,VLOOKUP($K35&N$14,Input!AT26:AU202,2,FALSE))","v":0},{"$f":"IF(ISNA(VLOOKUP($K35&O$14,Input!AT26:AT202,1,FALSE)),0,1)","v":0},0]
[null,"","","","",null,null,null,null,null,22,{"$f":"IF(ISNA(VLOOKUP($K36&L$14,Input!AT27:AT202,1,FALSE)),\"\",VLOOKUP($K36&L$14,Input!AT27:AW202,4,FALSE))","v":""},{"$f":"IF(ISNA(VLOOKUP($K36&M$14,Input!AT27:AT202,1,FALSE)),0,VLOOKUP($K36&M$14,Input!AT27:AU202,2,FALSE))","v":0},{"$f":"IF(ISNA(VLOOKUP($K36&N$14,Input!AT27:AT202,1,FALSE)),0,VLOOKUP($K36&N$14,Input!AT27:AU202,2,FALSE))","v":0},{"$f":"IF(ISNA(VLOOKUP($K36&O$14,Input!AT27:AT202,1,FALSE)),0,1)","v":0},0]
[null,"","","","",null,null,null,null,null,23,{"$f":"IF(ISNA(VLOOKUP($K37&L$14,Input!AT28:AT202,1,FALSE)),\"\",VLOOKUP($K37&L$14,Input!AT28:AW202,4,FALSE))","v":""},{"$f":"IF(ISNA(VLOOKUP($K37&M$14,Input!AT28:AT202,1,FALSE)),0,VLOOKUP($K37&M$14,Input!AT28:AU202,2,FALSE))","v":0},{"$f":"IF(ISNA(VLOOKUP($K37&N$14,Input!AT28:AT202,1,FALSE)),0,VLOOKUP($K37&N$14,Input!AT28:AU202,2,FALSE))","v":0},{"$f":"IF(ISNA(VLOOKUP($K37&O$14,Input!AT28:AT202,1,FALSE)),0,1)","v":0},0]
[null,"","","","",null,null,null,null,null,24,{"$f":"IF(ISNA(VLOOKUP($K38&L$14,Input!AT29:AT202,1,FALSE)),\"\",VLOOKUP($K38&L$14,Input!AT29:AW202,4,FALSE))","v":""},{"$f":"IF(ISNA(VLOOKUP($K38&M$14,Input!AT29:AT202,1,FALSE)),0,VLOOKUP($K38&M$14,Input!AT29:AU202,2,FALSE))","v":0},{"$f":"IF(ISNA(VLOOKUP($K38&N$14,Input!AT29:AT202,1,FALSE)),0,VLOOKUP($K38&N$14,Input!AT29:AU202,2,FALSE))","v":0},{"$f":"IF(ISNA(VLOOKUP($K38&O$14,Input!AT29:AT202,1,FALSE)),0,1)","v":0},0]
[null,"","","","",null,null,null,null,null,25,{"$f":"IF(ISNA(VLOOKUP($K39&L$14,Input!AT30:AT202,1,FALSE)),\"\",VLOOKUP($K39&L$14,Input!AT30:AW202,4,FALSE))","v":""},{"$f":"IF(ISNA(VLOOKUP($K39&M$14,Input!AT30:AT202,1,FALSE)),0,VLOOKUP($K39&M$14,Input!AT30:AU202,2,FALSE))","v":0},{"$f":"IF(ISNA(VLOOKUP($K39&N$14,Input!AT30:AT202,1,FALSE)),0,VLOOKUP($K39&N$14,Input!AT30:AU202,2,FALSE))","v":0},{"$f":"IF(ISNA(VLOOKUP($K39&O$14,Input!AT30:AT202,1,FALSE)),0,1)","v":0},0]
[null,"","","","",null,null,null,null,null,26,{"$f":"IF(ISNA(VLOOKUP($K40&L$14,Input!AT31:AT202,1,FALSE)),\"\",VLOOKUP($K40&L$14,Input!AT31:AW202,4,FALSE))","v":""},{"$f":"IF(ISNA(VLOOKUP($K40&M$14,Input!AT31:AT202,1,FALSE)),0,VLOOKUP($K40&M$14,Input!AT31:AU202,2,FALSE))","v":0},{"$f":"IF(ISNA(VLOOKUP($K40&N$14,Input!AT31:AT202,1,FALSE)),0,VLOOKUP($K40&N$14,Input!AT31:AU202,2,FALSE))","v":0},{"$f":"IF(ISNA(VLOOKUP($K40&O$14,Input!AT31:AT202,1,FALSE)),0,1)","v":0},0]
[null,"","","","",null,null,null,null,null,27,{"$f":"IF(ISNA(VLOOKUP($K41&L$14,Input!AT32:AT202,1,FALSE)),\"\",VLOOKUP($K41&L$14,Input!AT32:AW202,4,FALSE))","v":""},{"$f":"IF(ISNA(VLOOKUP($K41&M$14,Input!AT32:AT202,1,FALSE)),0,VLOOKUP($K41&M$14,Input!AT32:AU202,2,FALSE))","v":0},{"$f":"IF(ISNA(VLOOKUP($K41&N$14,Input!AT32:AT202,1,FALSE)),0,VLOOKUP($K41&N$14,Input!AT32:AU202,2,FALSE))","v":0},{"$f":"IF(ISNA(VLOOKUP($K41&O$14,Input!AT32:AT202,1,FALSE)),0,1)","v":0},0]
[null,"","","","",null,null,null,null,null,28,{"$f":"IF(ISNA(VLOOKUP($K42&L$14,Input!AT33:AT202,1,FALSE)),\"\",VLOOKUP($K42&L$14,Input!AT33:AW202,4,FALSE))","v":""},{"$f":"IF(ISNA(VLOOKUP($K42&M$14,Input!AT33:AT202,1,FALSE)),0,VLOOKUP($K42&M$14,Input!AT33:AU202,2,FALSE))","v":0},{"$f":"IF(ISNA(VLOOKUP($K42&N$14,Input!AT33:AT202,1,FALSE)),0,VLOOKUP($K42&N$14,Input!AT33:AU202,2,FALSE))","v":0},{"$f":"IF(ISNA(VLOOKUP($K42&O$14,Input!AT33:AT202,1,FALSE)),0,1)","v":0},0]
[null,"","","","",null,null,null,null,null,29,{"$f":"IF(ISNA(VLOOKUP($K43&L$14,Input!AT34:AT202,1,FALSE)),\"\",VLOOKUP($K43&L$14,Input!AT34:AW202,4,FALSE))","v":""},{"$f":"IF(ISNA(VLOOKUP($K43&M$14,Input!AT34:AT202,1,FALSE)),0,VLOOKUP($K43&M$14,Input!AT34:AU202,2,FALSE))","v":0},{"$f":"IF(ISNA(VLOOKUP($K43&N$14,Input!AT34:AT202,1,FALSE)),0,VLOOKUP($K43&N$14,Input!AT34:AU202,2,FALSE))","v":0},{"$f":"IF(ISNA(VLOOKUP($K43&O$14,Input!AT34:AT202,1,FALSE)),0,1)","v":0},0]
[null,"","","","",null,null,null,null,null,30,{"$f":"IF(ISNA(VLOOKUP($K44&L$14,Input!AT35:AT202,1,FALSE)),\"\",VLOOKUP($K44&L$14,Input!AT35:AW202,4,FALSE))","v":""},{"$f":"IF(ISNA(VLOOKUP($K44&M$14,Input!AT35:AT202,1,FALSE)),0,VLOOKUP($K44&M$14,Input!AT35:AU202,2,FALSE))","v":0},{"$f":"IF(ISNA(VLOOKUP($K44&N$14,Input!AT35:AT202,1,FALSE)),0,VLOOKUP($K44&N$14,Input!AT35:AU202,2,FALSE))","v":0},{"$f":"IF(ISNA(VLOOKUP($K44&O$14,Input!AT35:AT202,1,FALSE)),0,1)","v":0},0]
[null,"","","","",null,null,null,null,null,31,{"$f":"IF(ISNA(VLOOKUP($K45&L$14,Input!AT36:AT202,1,FALSE)),\"\",VLOOKUP($K45&L$14,Input!AT36:AW202,4,FALSE))","v":""},{"$f":"IF(ISNA(VLOOKUP($K45&M$14,Input!AT36:AT202,1,FALSE)),0,VLOOKUP($K45&M$14,Input!AT36:AU202,2,FALSE))","v":0},{"$f":"IF(ISNA(VLOOKUP($K45&N$14,Input!AT36:AT202,1,FALSE)),0,VLOOKUP($K45&N$14,Input!AT36:AU202,2,FALSE))","v":0},{"$f":"IF(ISNA(VLOOKUP($K45&O$14,Input!AT36:AT202,1,FALSE)),0,1)","v":0},0]
[null,"","","","",null,null,null,null,null,32,{"$f":"IF(ISNA(VLOOKUP($K46&L$14,Input!AT37:AT202,1,FALSE)),\"\",VLOOKUP($K46&L$14,Input!AT37:AW202,4,FALSE))","v":""},{"$f":"IF(ISNA(VLOOKUP($K46&M$14,Input!AT37:AT202,1,FALSE)),0,VLOOKUP($K46&M$14,Input!AT37:AU202,2,FALSE))","v":0},{"$f":"IF(ISNA(VLOOKUP($K46&N$14,Input!AT37:AT202,1,FALSE)),0,VLOOKUP($K46&N$14,Input!AT37:AU202,2,FALSE))","v":0},{"$f":"IF(ISNA(VLOOKUP($K46&O$14,Input!AT37:AT202,1,FALSE)),0,1)","v":0},0]
[null,{"$f":"IF(C47=\"\",\"\",K47)","v":""},"","","",null,null,null,null,null,33,{"$f":"IF(ISNA(VLOOKUP($K47&L$14,Input!AT38:AT202,1,FALSE)),\"\",VLOOKUP($K47&L$14,Input!AT38:AW202,4,FALSE))","v":""},{"$f":"IF(ISNA(VLOOKUP($K47&M$14,Input!AT38:AT202,1,FALSE)),0,VLOOKUP($K47&M$14,Input!AT38:AU202,2,FALSE))","v":0},{"$f":"IF(ISNA(VLOOKUP($K47&N$14,Input!AT38:AT202,1,FALSE)),0,VLOOKUP($K47&N$14,Input!AT38:AU202,2,FALSE))","v":0},{"$f":"IF(ISNA(VLOOKUP($K47&O$14,Input!AT38:AT202,1,FALSE)),0,1)","v":0},0]
[null,"","","","",null,null,null,null,null,34,{"$f":"IF(ISNA(VLOOKUP($K48&L$14,Input!AT39:AT202,1,FALSE)),\"\",VLOOKUP($K48&L$14,Input!AT39:AW202,4,FALSE))","v":""},{"$f":"IF(ISNA(VLOOKUP($K48&M$14,Input!AT39:AT202,1,FALSE)),0,VLOOKUP($K48&M$14,Input!AT39:AU202,2,FALSE))","v":0},{"$f":"IF(ISNA(VLOOKUP($K48&N$14,Input!AT39:AT202,1,FALSE)),0,VLOOKUP($K48&N$14,Input!AT39:AU202,2,FALSE))","v":0},{"$f":"IF(ISNA(VLOOKUP($K48&O$14,Input!AT39:AT202,1,FALSE)),0,1)","v":0},0]
[null,"","","","",null,null,null,null,null,35,{"$f":"IF(ISNA(VLOOKUP($K49&L$14,Input!AT40:AT202,1,FALSE)),\"\",VLOOKUP($K49&L$14,Input!AT40:AW202,4,FALSE))","v":""},{"$f":"IF(ISNA(VLOOKUP($K49&M$14,Input!AT40:AT202,1,FALSE)),0,VLOOKUP($K49&M$14,Input!AT40:AU202,2,FALSE))","v":0},{"$f":"IF(ISNA(VLOOKUP($K49&N$14,Input!AT40:AT202,1,FALSE)),0,VLOOKUP($K49&N$14,Input!AT40:AU202,2,FALSE))","v":0},{"$f":"IF(ISNA(VLOOKUP($K49&O$14,Input!AT40:AT202,1,FALSE)),0,1)","v":0},0]
[null,"","","","",null,null,null,null,null,36,{"$f":"IF(ISNA(VLOOKUP($K50&L$14,Input!AT41:AT202,1,FALSE)),\"\",VLOOKUP($K50&L$14,Input!AT41:AW202,4,FALSE))","v":""},{"$f":"IF(ISNA(VLOOKUP($K50&M$14,Input!AT41:AT202,1,FALSE)),0,VLOOKUP($K50&M$14,Input!AT41:AU202,2,FALSE))","v":0},{"$f":"IF(ISNA(VLOOKUP($K50&N$14,Input!AT41:AT202,1,FALSE)),0,VLOOKUP($K50&N$14,Input!AT41:AU202,2,FALSE))","v":0},{"$f":"IF(ISNA(VLOOKUP($K50&O$14,Input!AT41:AT202,1,FALSE)),0,1)","v":0},0]
[null,"","","","",null,null,null,null,null,37,{"$f":"IF(ISNA(VLOOKUP($K51&L$14,Input!AT42:AT202,1,FALSE)),\"\",VLOOKUP($K51&L$14,Input!AT42:AW202,4,FALSE))","v":""},{"$f":"IF(ISNA(VLOOKUP($K51&M$14,Input!AT42:AT202,1,FALSE)),0,VLOOKUP($K51&M$14,Input!AT42:AU202,2,FALSE))","v":0},{"$f":"IF(ISNA(VLOOKUP($K51&N$14,Input!AT42:AT202,1,FALSE)),0,VLOOKUP($K51&N$14,Input!AT42:AU202,2,FALSE))","v":0},{"$f":"IF(ISNA(VLOOKUP($K51&O$14,Input!AT42:AT202,1,FALSE)),0,1)","v":0},0]
[null,"","","","",null,null,null,null,null,38,{"$f":"IF(ISNA(VLOOKUP($K52&L$14,Input!AT43:AT202,1,FALSE)),\"\",VLOOKUP($K52&L$14,Input!AT43:AW202,4,FALSE))","v":""},{"$f":"IF(ISNA(VLOOKUP($K52&M$14,Input!AT43:AT202,1,FALSE)),0,VLOOKUP($K52&M$14,Input!AT43:AU202,2,FALSE))","v":0},{"$f":"IF(ISNA(VLOOKUP($K52&N$14,Input!AT43:AT202,1,FALSE)),0,VLOOKUP($K52&N$14,Input!AT43:AU202,2,FALSE))","v":0},{"$f":"IF(ISNA(VLOOKUP($K52&O$14,Input!AT43:AT202,1,FALSE)),0,1)","v":0},0]
[null,"","","","",null,null,null,null,null,39,{"$f":"IF(ISNA(VLOOKUP($K53&L$14,Input!AT44:AT202,1,FALSE)),\"\",VLOOKUP($K53&L$14,Input!AT44:AW202,4,FALSE))","v":""},{"$f":"IF(ISNA(VLOOKUP($K53&M$14,Input!AT44:AT202,1,FALSE)),0,VLOOKUP($K53&M$14,Input!AT44:AU202,2,FALSE))","v":0},{"$f":"IF(ISNA(VLOOKUP($K53&N$14,Input!AT44:AT202,1,FALSE)),0,VLOOKUP($K53&N$14,Input!AT44:AU202,2,FALSE))","v":0},{"$f":"IF(ISNA(VLOOKUP($K53&O$14,Input!AT44:AT202,1,FALSE)),0,1)","v":0},0]
[null,"","","","",null,null,null,null,null,40,{"$f":"IF(ISNA(VLOOKUP($K54&L$14,Input!AT45:AT202,1,FALSE)),\"\",VLOOKUP($K54&L$14,Input!AT45:AW202,4,FALSE))","v":""},{"$f":"IF(ISNA(VLOOKUP($K54&M$14,Input!AT45:AT202,1,FALSE)),0,VLOOKUP($K54&M$14,Input!AT45:AU202,2,FALSE))","v":0},{"$f":"IF(ISNA(VLOOKUP($K54&N$14,Input!AT45:AT202,1,FALSE)),0,VLOOKUP($K54&N$14,Input!AT45:AU202,2,FALSE))","v":0},{"$f":"IF(ISNA(VLOOKUP($K54&O$14,Input!AT45:AT202,1,FALSE)),0,1)","v":0},0]
[null,"","","","",null,null,null,null,null,41,{"$f":"IF(ISNA(VLOOKUP($K55&L$14,Input!AT46:AT202,1,FALSE)),\"\",VLOOKUP($K55&L$14,Input!AT46:AW202,4,FALSE))","v":""},{"$f":"IF(ISNA(VLOOKUP($K55&M$14,Input!AT46:AT202,1,FALSE)),0,VLOOKUP($K55&M$14,Input!AT46:AU202,2,FALSE))","v":0},{"$f":"IF(ISNA(VLOOKUP($K55&N$14,Input!AT46:AT202,1,FALSE)),0,VLOOKUP($K55&N$14,Input!AT46:AU202,2,FALSE))","v":0},{"$f":"IF(ISNA(VLOOKUP($K55&O$14,Input!AT46:AT202,1,FALSE)),0,1)","v":0},0]
[null,"","","","",null,null,null,null,null,42,{"$f":"IF(ISNA(VLOOKUP($K56&L$14,Input!AT47:AT202,1,FALSE)),\"\",VLOOKUP($K56&L$14,Input!AT47:AW202,4,FALSE))","v":""},{"$f":"IF(ISNA(VLOOKUP($K56&M$14,Input!AT47:AT202,1,FALSE)),0,VLOOKUP($K56&M$14,Input!AT47:AU202,2,FALSE))","v":0},{"$f":"IF(ISNA(VLOOKUP($K56&N$14,Input!AT47:AT202,1,FALSE)),0,VLOOKUP($K56&N$14,Input!AT47:AU202,2,FALSE))","v":0},{"$f":"IF(ISNA(VLOOKUP($K56&O$14,Input!AT47:AT202,1,FALSE)),0,1)","v":0},0]
[null,"","","","",null,null,null,null,null,43,{"$f":"IF(ISNA(VLOOKUP($K57&L$14,Input!AT48:AT202,1,FALSE)),\"\",VLOOKUP($K57&L$14,Input!AT48:AW202,4,FALSE))","v":""},{"$f":"IF(ISNA(VLOOKUP($K57&M$14,Input!AT48:AT202,1,FALSE)),0,VLOOKUP($K57&M$14,Input!AT48:AU202,2,FALSE))","v":0},{"$f":"IF(ISNA(VLOOKUP($K57&N$14,Input!AT48:AT202,1,FALSE)),0,VLOOKUP($K57&N$14,Input!AT48:AU202,2,FALSE))","v":0},{"$f":"IF(ISNA(VLOOKUP($K57&O$14,Input!AT48:AT202,1,FALSE)),0,1)","v":0},0]
[null,"","","","",null,null,null,null,null,44,{"$f":"IF(ISNA(VLOOKUP($K58&L$14,Input!AT49:AT202,1,FALSE)),\"\",VLOOKUP($K58&L$14,Input!AT49:AW202,4,FALSE))","v":""},{"$f":"IF(ISNA(VLOOKUP($K58&M$14,Input!AT49:AT202,1,FALSE)),0,VLOOKUP($K58&M$14,Input!AT49:AU202,2,FALSE))","v":0},{"$f":"IF(ISNA(VLOOKUP($K58&N$14,Input!AT49:AT202,1,FALSE)),0,VLOOKUP($K58&N$14,Input!AT49:AU202,2,FALSE))","v":0},{"$f":"IF(ISNA(VLOOKUP($K58&O$14,Input!AT49:AT202,1,FALSE)),0,1)","v":0},0]
[null,"","","","",null,null,null,null,null,45,{"$f":"IF(ISNA(VLOOKUP($K59&L$14,Input!AT50:AT202,1,FALSE)),\"\",VLOOKUP($K59&L$14,Input!AT50:AW202,4,FALSE))","v":""},{"$f":"IF(ISNA(VLOOKUP($K59&M$14,Input!AT50:AT202,1,FALSE)),0,VLOOKUP($K59&M$14,Input!AT50:AU202,2,FALSE))","v":0},{"$f":"IF(ISNA(VLOOKUP($K59&N$14,Input!AT50:AT202,1,FALSE)),0,VLOOKUP($K59&N$14,Input!AT50:AU202,2,FALSE))","v":0},{"$f":"IF(ISNA(VLOOKUP($K59&O$14,Input!AT50:AT202,1,FALSE)),0,1)","v":0},0]
[null,"","","","",null,null,null,null,null,46,{"$f":"IF(ISNA(VLOOKUP($K60&L$14,Input!AT51:AT202,1,FALSE)),\"\",VLOOKUP($K60&L$14,Input!AT51:AW202,4,FALSE))","v":""},{"$f":"IF(ISNA(VLOOKUP($K60&M$14,Input!AT51:AT202,1,FALSE)),0,VLOOKUP($K60&M$14,Input!AT51:AU202,2,FALSE))","v":0},{"$f":"IF(ISNA(VLOOKUP($K60&N$14,Input!AT51:AT202,1,FALSE)),0,VLOOKUP($K60&N$14,Input!AT51:AU202,2,FALSE))","v":0},{"$f":"IF(ISNA(VLOOKUP($K60&O$14,Input!AT51:AT202,1,FALSE)),0,1)","v":0},0]
[null,"","","","",null,null,null,null,null,47,{"$f":"IF(ISNA(VLOOKUP($K61&L$14,Input!AT52:AT202,1,FALSE)),\"\",VLOOKUP($K61&L$14,Input!AT52:AW202,4,FALSE))","v":""},{"$f":"IF(ISNA(VLOOKUP($K61&M$14,Input!AT52:AT202,1,FALSE)),0,VLOOKUP($K61&M$14,Input!AT52:AU202,2,FALSE))","v":0},{"$f":"IF(ISNA(VLOOKUP($K61&N$14,Input!AT52:AT202,1,FALSE)),0,VLOOKUP($K61&N$14,Input!AT52:AU202,2,FALSE))","v":0},{"$f":"IF(ISNA(VLOOKUP($K61&O$14,Input!AT52:AT202,1,FALSE)),0,1)","v":0},0]
[null,"","","","",null,null,null,null,null,48,{"$f":"IF(ISNA(VLOOKUP($K62&L$14,Input!AT53:AT202,1,FALSE)),\"\",VLOOKUP($K62&L$14,Input!AT53:AW202,4,FALSE))","v":""},{"$f":"IF(ISNA(VLOOKUP($K62&M$14,Input!AT53:AT202,1,FALSE)),0,VLOOKUP($K62&M$14,Input!AT53:AU202,2,FALSE))","v":0},{"$f":"IF(ISNA(VLOOKUP($K62&N$14,Input!AT53:AT202,1,FALSE)),0,VLOOKUP($K62&N$14,Input!AT53:AU202,2,FALSE))","v":0},{"$f":"IF(ISNA(VLOOKUP($K62&O$14,Input!AT53:AT202,1,FALSE)),0,1)","v":0},0]
[null,"","","","",null,null,null,null,null,49,{"$f":"IF(ISNA(VLOOKUP($K63&L$14,Input!AT54:AT202,1,FALSE)),\"\",VLOOKUP($K63&L$14,Input!AT54:AW202,4,FALSE))","v":""},{"$f":"IF(ISNA(VLOOKUP($K63&M$14,Input!AT54:AT202,1,FALSE)),0,VLOOKUP($K63&M$14,Input!AT54:AU202,2,FALSE))","v":0},{"$f":"IF(ISNA(VLOOKUP($K63&N$14,Input!AT54:AT202,1,FALSE)),0,VLOOKUP($K63&N$14,Input!AT54:AU202,2,FALSE))","v":0},{"$f":"IF(ISNA(VLOOKUP($K63&O$14,Input!AT54:AT202,1,FALSE)),0,1)","v":0},0]
[null,"","","","",null,null,null,null,null,50,{"$f":"IF(ISNA(VLOOKUP($K64&L$14,Input!AT55:AT202,1,FALSE)),\"\",VLOOKUP($K64&L$14,Input!AT55:AW202,4,FALSE))","v":""},{"$f":"IF(ISNA(VLOOKUP($K64&M$14,Input!AT55:AT202,1,FALSE)),0,VLOOKUP($K64&M$14,Input!AT55:AU202,2,FALSE))","v":0},{"$f":"IF(ISNA(VLOOKUP($K64&N$14,Input!AT55:AT202,1,FALSE)),0,VLOOKUP($K64&N$14,Input!AT55:AU202,2,FALSE))","v":0},{"$f":"IF(ISNA(VLOOKUP($K64&O$14,Input!AT55:AT202,1,FALSE)),0,1)","v":0},0]
[null,null,null,null,null,null,null,null,null,null,51,{"$f":"IF(ISNA(VLOOKUP($K65&L$14,Input!AT56:AT202,1,FALSE)),\"\",VLOOKUP($K65&L$14,Input!AT56:AW202,4,FALSE))","v":""},{"$f":"IF(ISNA(VLOOKUP($K65&M$14,Input!AT56:AT202,1,FALSE)),0,VLOOKUP($K65&M$14,Input!AT56:AU202,2,FALSE))","v":0},{"$f":"IF(ISNA(VLOOKUP($K65&N$14,Input!AT56:AT202,1,FALSE)),0,VLOOKUP($K65&N$14,Input!AT56:AU202,2,FALSE))","v":0},{"$f":"IF(ISNA(VLOOKUP($K65&O$14,Input!AT56:AT202,1,FALSE)),0,1)","v":0},{"$f":"IF(M65=0,0,1)+IF(N65=0,0,2)+IF(O65=0,0,4)","v":0}]
[null,null,null,null,null,null,null,null,null,null,52,{"$f":"IF(ISNA(VLOOKUP($K66&L$14,Input!AT57:AT202,1,FALSE)),\"\",VLOOKUP($K66&L$14,Input!AT57:AW202,4,FALSE))","v":""},{"$f":"IF(ISNA(VLOOKUP($K66&M$14,Input!AT57:AT202,1,FALSE)),0,VLOOKUP($K66&M$14,Input!AT57:AU202,2,FALSE))","v":0},{"$f":"IF(ISNA(VLOOKUP($K66&N$14,Input!AT57:AT202,1,FALSE)),0,VLOOKUP($K66&N$14,Input!AT57:AU202,2,FALSE))","v":0},{"$f":"IF(ISNA(VLOOKUP($K66&O$14,Input!AT57:AT202,1,FALSE)),0,1)","v":0},0]
[null,null,null,null,null,null,null,null,null,null,53,{"$f":"IF(ISNA(VLOOKUP($K67&L$14,Input!AT58:AT202,1,FALSE)),\"\",VLOOKUP($K67&L$14,Input!AT58:AW202,4,FALSE))","v":""},{"$f":"IF(ISNA(VLOOKUP($K67&M$14,Input!AT58:AT202,1,FALSE)),0,VLOOKUP($K67&M$14,Input!AT58:AU202,2,FALSE))","v":0},{"$f":"IF(ISNA(VLOOKUP($K67&N$14,Input!AT58:AT202,1,FALSE)),0,VLOOKUP($K67&N$14,Input!AT58:AU202,2,FALSE))","v":0},{"$f":"IF(ISNA(VLOOKUP($K67&O$14,Input!AT58:AT202,1,FALSE)),0,1)","v":0},0]
[null,null,null,null,null,null,null,null,null,null,54,{"$f":"IF(ISNA(VLOOKUP($K68&L$14,Input!AT59:AT202,1,FALSE)),\"\",VLOOKUP($K68&L$14,Input!AT59:AW202,4,FALSE))","v":""},{"$f":"IF(ISNA(VLOOKUP($K68&M$14,Input!AT59:AT202,1,FALSE)),0,VLOOKUP($K68&M$14,Input!AT59:AU202,2,FALSE))","v":0},{"$f":"IF(ISNA(VLOOKUP($K68&N$14,Input!AT59:AT202,1,FALSE)),0,VLOOKUP($K68&N$14,Input!AT59:AU202,2,FALSE))","v":0},{"$f":"IF(ISNA(VLOOKUP($K68&O$14,Input!AT59:AT202,1,FALSE)),0,1)","v":0},0]
[null,null,null,null,null,null,null,null,null,null,55,{"$f":"IF(ISNA(VLOOKUP($K69&L$14,Input!AT60:AT202,1,FALSE)),\"\",VLOOKUP($K69&L$14,Input!AT60:AW202,4,FALSE))","v":""},{"$f":"IF(ISNA(VLOOKUP($K69&M$14,Input!AT60:AT202,1,FALSE)),0,VLOOKUP($K69&M$14,Input!AT60:AU202,2,FALSE))","v":0},{"$f":"IF(ISNA(VLOOKUP($K69&N$14,Input!AT60:AT202,1,FALSE)),0,VLOOKUP($K69&N$14,Input!AT60:AU202,2,FALSE))","v":0},{"$f":"IF(ISNA(VLOOKUP($K69&O$14,Input!AT60:AT202,1,FALSE)),0,1)","v":0},0]
[null,null,null,null,null,null,null,null,null,null,56,{"$f":"IF(ISNA(VLOOKUP($K70&L$14,Input!AT61:AT202,1,FALSE)),\"\",VLOOKUP($K70&L$14,Input!AT61:AW202,4,FALSE))","v":""},{"$f":"IF(ISNA(VLOOKUP($K70&M$14,Input!AT61:AT202,1,FALSE)),0,VLOOKUP($K70&M$14,Input!AT61:AU202,2,FALSE))","v":0},{"$f":"IF(ISNA(VLOOKUP($K70&N$14,Input!AT61:AT202,1,FALSE)),0,VLOOKUP($K70&N$14,Input!AT61:AU202,2,FALSE))","v":0},{"$f":"IF(ISNA(VLOOKUP($K70&O$14,Input!AT61:AT202,1,FALSE)),0,1)","v":0},0]
[null,null,null,null,null,null,null,null,null,null,57,{"$f":"IF(ISNA(VLOOKUP($K71&L$14,Input!AT62:AT202,1,FALSE)),\"\",VLOOKUP($K71&L$14,Input!AT62:AW202,4,FALSE))","v":""},{"$f":"IF(ISNA(VLOOKUP($K71&M$14,Input!AT62:AT202,1,FALSE)),0,VLOOKUP($K71&M$14,Input!AT62:AU202,2,FALSE))","v":0},{"$f":"IF(ISNA(VLOOKUP($K71&N$14,Input!AT62:AT202,1,FALSE)),0,VLOOKUP($K71&N$14,Input!AT62:AU202,2,FALSE))","v":0},{"$f":"IF(ISNA(VLOOKUP($K71&O$14,Input!AT62:AT202,1,FALSE)),0,1)","v":0},0]
[null,null,null,null,null,null,null,null,null,null,58,{"$f":"IF(ISNA(VLOOKUP($K72&L$14,Input!AT63:AT202,1,FALSE)),\"\",VLOOKUP($K72&L$14,Input!AT63:AW202,4,FALSE))","v":""},{"$f":"IF(ISNA(VLOOKUP($K72&M$14,Input!AT63:AT202,1,FALSE)),0,VLOOKUP($K72&M$14,Input!AT63:AU202,2,FALSE))","v":0},{"$f":"IF(ISNA(VLOOKUP($K72&N$14,Input!AT63:AT202,1,FALSE)),0,VLOOKUP($K72&N$14,Input!AT63:AU202,2,FALSE))","v":0},{"$f":"IF(ISNA(VLOOKUP($K72&O$14,Input!AT63:AT202,1,FALSE)),0,1)","v":0},0]
[null,null,null,null,null,null,null,null,null,null,59,{"$f":"IF(ISNA(VLOOKUP($K73&L$14,Input!AT64:AT202,1,FALSE)),\"\",VLOOKUP($K73&L$14,Input!AT64:AW202,4,FALSE))","v":""},{"$f":"IF(ISNA(VLOOKUP($K73&M$14,Input!AT64:AT202,1,FALSE)),0,VLOOKUP($K73&M$14,Input!AT64:AU202,2,FALSE))","v":0},{"$f":"IF(ISNA(VLOOKUP($K73&N$14,Input!AT64:AT202,1,FALSE)),0,VLOOKUP($K73&N$14,Input!AT64:AU202,2,FALSE))","v":0},{"$f":"IF(ISNA(VLOOKUP($K73&O$14,Input!AT64:AT202,1,FALSE)),0,1)","v":0},0]
[null,null,null,null,null,null,null,null,null,null,60,{"$f":"IF(ISNA(VLOOKUP($K74&L$14,Input!AT65:AT202,1,FALSE)),\"\",VLOOKUP($K74&L$14,Input!AT65:AW202,4,FALSE))","v":""},{"$f":"IF(ISNA(VLOOKUP($K74&M$14,Input!AT65:AT202,1,FALSE)),0,VLOOKUP($K74&M$14,Input!AT65:AU202,2,FALSE))","v":0},{"$f":"IF(ISNA(VLOOKUP($K74&N$14,Input!AT65:AT202,1,FALSE)),0,VLOOKUP($K74&N$14,Input!AT65:AU202,2,FALSE))","v":0},{"$f":"IF(ISNA(VLOOKUP($K74&O$14,Input!AT65:AT202,1,FALSE)),0,1)","v":0},0]
[null,null,null,null,null,null,null,null,null,null,61,{"$f":"IF(ISNA(VLOOKUP($K75&L$14,Input!AT66:AT202,1,FALSE)),\"\",VLOOKUP($K75&L$14,Input!AT66:AW202,4,FALSE))","v":""},{"$f":"IF(ISNA(VLOOKUP($K75&M$14,Input!AT66:AT202,1,FALSE)),0,VLOOKUP($K75&M$14,Input!AT66:AU202,2,FALSE))","v":0},{"$f":"IF(ISNA(VLOOKUP($K75&N$14,Input!AT66:AT202,1,FALSE)),0,VLOOKUP($K75&N$14,Input!AT66:AU202,2,FALSE))","v":0},{"$f":"IF(ISNA(VLOOKUP($K75&O$14,Input!AT66:AT202,1,FALSE)),0,1)","v":0},0]
[null,null,null,null,null,null,null,null,null,null,62,{"$f":"IF(ISNA(VLOOKUP($K76&L$14,Input!AT67:AT202,1,FALSE)),\"\",VLOOKUP($K76&L$14,Input!AT67:AW202,4,FALSE))","v":""},{"$f":"IF(ISNA(VLOOKUP($K76&M$14,Input!AT67:AT202,1,FALSE)),0,VLOOKUP($K76&M$14,Input!AT67:AU202,2,FALSE))","v":0},{"$f":"IF(ISNA(VLOOKUP($K76&N$14,Input!AT67:AT202,1,FALSE)),0,VLOOKUP($K76&N$14,Input!AT67:AU202,2,FALSE))","v":0},{"$f":"IF(ISNA(VLOOKUP($K76&O$14,Input!AT67:AT202,1,FALSE)),0,1)","v":0},0]
[null,null,null,null,null,null,null,null,null,null,63,{"$f":"IF(ISNA(VLOOKUP($K77&L$14,Input!AT68:AT202,1,FALSE)),\"\",VLOOKUP($K77&L$14,Input!AT68:AW202,4,FALSE))","v":""},{"$f":"IF(ISNA(VLOOKUP($K77&M$14,Input!AT68:AT202,1,FALSE)),0,VLOOKUP($K77&M$14,Input!AT68:AU202,2,FALSE))","v":0},{"$f":"IF(ISNA(VLOOKUP($K77&N$14,Input!AT68:AT202,1,FALSE)),0,VLOOKUP($K77&N$14,Input!AT68:AU202,2,FALSE))","v":0},{"$f":"IF(ISNA(VLOOKUP($K77&O$14,Input!AT68:AT202,1,FALSE)),0,1)","v":0},0]
[null,null,null,null,null,null,null,null,null,null,64,{"$f":"IF(ISNA(VLOOKUP($K78&L$14,Input!AT69:AT202,1,FALSE)),\"\",VLOOKUP($K78&L$14,Input!AT69:AW202,4,FALSE))","v":""},{"$f":"IF(ISNA(VLOOKUP($K78&M$14,Input!AT69:AT202,1,FALSE)),0,VLOOKUP($K78&M$14,Input!AT69:AU202,2,FALSE))","v":0},{"$f":"IF(ISNA(VLOOKUP($K78&N$14,Input!AT69:AT202,1,FALSE)),0,VLOOKUP($K78&N$14,Input!AT69:AU202,2,FALSE))","v":0},{"$f":"IF(ISNA(VLOOKUP($K78&O$14,Input!AT69:AT202,1,FALSE)),0,1)","v":0},0]
[null,null,null,null,null,null,null,null,null,null,65,{"$f":"IF(ISNA(VLOOKUP($K79&L$14,Input!AT70:AT202,1,FALSE)),\"\",VLOOKUP($K79&L$14,Input!AT70:AW202,4,FALSE))","v":""},{"$f":"IF(ISNA(VLOOKUP($K79&M$14,Input!AT70:AT202,1,FALSE)),0,VLOOKUP($K79&M$14,Input!AT70:AU202,2,FALSE))","v":0},{"$f":"IF(ISNA(VLOOKUP($K79&N$14,Input!AT70:AT202,1,FALSE)),0,VLOOKUP($K79&N$14,Input!AT70:AU202,2,FALSE))","v":0},{"$f":"IF(ISNA(VLOOKUP($K79&O$14,Input!AT70:AT202,1,FALSE)),0,1)","v":0},0]
[null,null,null,null,null,null,null,null,null,null,66,{"$f":"IF(ISNA(VLOOKUP($K80&L$14,Input!AT71:AT202,1,FALSE)),\"\",VLOOKUP($K80&L$14,Input!AT71:AW202,4,FALSE))","v":""},{"$f":"IF(ISNA(VLOOKUP($K80&M$14,Input!AT71:AT202,1,FALSE)),0,VLOOKUP($K80&M$14,Input!AT71:AU202,2,FALSE))","v":0},{"$f":"IF(ISNA(VLOOKUP($K80&N$14,Input!AT71:AT202,1,FALSE)),0,VLOOKUP($K80&N$14,Input!AT71:AU202,2,FALSE))","v":0},{"$f":"IF(ISNA(VLOOKUP($K80&O$14,Input!AT71:AT202,1,FALSE)),0,1)","v":0},0]
[null,null,null,null,null,null,null,null,null,null,67,{"$f":"IF(ISNA(VLOOKUP($K81&L$14,Input!AT72:AT202,1,FALSE)),\"\",VLOOKUP($K81&L$14,Input!AT72:AW202,4,FALSE))","v":""},{"$f":"IF(ISNA(VLOOKUP($K81&M$14,Input!AT72:AT202,1,FALSE)),0,VLOOKUP($K81&M$14,Input!AT72:AU202,2,FALSE))","v":0},{"$f":"IF(ISNA(VLOOKUP($K81&N$14,Input!AT72:AT202,1,FALSE)),0,VLOOKUP($K81&N$14,Input!AT72:AU202,2,FALSE))","v":0},{"$f":"IF(ISNA(VLOOKUP($K81&O$14,Input!AT72:AT202,1,FALSE)),0,1)","v":0},0]
[null,null,null,null,null,null,null,null,null,null,68,{"$f":"IF(ISNA(VLOOKUP($K82&L$14,Input!AT73:AT202,1,FALSE)),\"\",VLOOKUP($K82&L$14,Input!AT73:AW202,4,FALSE))","v":""},{"$f":"IF(ISNA(VLOOKUP($K82&M$14,Input!AT73:AT202,1,FALSE)),0,VLOOKUP($K82&M$14,Input!AT73:AU202,2,FALSE))","v":0},{"$f":"IF(ISNA(VLOOKUP($K82&N$14,Input!AT73:AT202,1,FALSE)),0,VLOOKUP($K82&N$14,Input!AT73:AU202,2,FALSE))","v":0},{"$f":"IF(ISNA(VLOOKUP($K82&O$14,Input!AT73:AT202,1,FALSE)),0,1)","v":0},0]
[null,null,null,null,null,null,null,null,null,null,69,{"$f":"IF(ISNA(VLOOKUP($K83&L$14,Input!AT74:AT202,1,FALSE)),\"\",VLOOKUP($K83&L$14,Input!AT74:AW202,4,FALSE))","v":""},{"$f":"IF(ISNA(VLOOKUP($K83&M$14,Input!AT74:AT202,1,FALSE)),0,VLOOKUP($K83&M$14,Input!AT74:AU202,2,FALSE))","v":0},{"$f":"IF(ISNA(VLOOKUP($K83&N$14,Input!AT74:AT202,1,FALSE)),0,VLOOKUP($K83&N$14,Input!AT74:AU202,2,FALSE))","v":0},{"$f":"IF(ISNA(VLOOKUP($K83&O$14,Input!AT74:AT202,1,FALSE)),0,1)","v":0},0]
[null,null,null,null,null,null,null,null,null,null,70,{"$f":"IF(ISNA(VLOOKUP($K84&L$14,Input!AT75:AT202,1,FALSE)),\"\",VLOOKUP($K84&L$14,Input!AT75:AW202,4,FALSE))","v":""},{"$f":"IF(ISNA(VLOOKUP($K84&M$14,Input!AT75:AT202,1,FALSE)),0,VLOOKUP($K84&M$14,Input!AT75:AU202,2,FALSE))","v":0},{"$f":"IF(ISNA(VLOOKUP($K84&N$14,Input!AT75:AT202,1,FALSE)),0,VLOOKUP($K84&N$14,Input!AT75:AU202,2,FALSE))","v":0},{"$f":"IF(ISNA(VLOOKUP($K84&O$14,Input!AT75:AT202,1,FALSE)),0,1)","v":0},0]
[null,null,null,null,null,null,null,null,null,null,71,{"$f":"IF(ISNA(VLOOKUP($K85&L$14,Input!AT76:AT202,1,FALSE)),\"\",VLOOKUP($K85&L$14,Input!AT76:AW202,4,FALSE))","v":""},{"$f":"IF(ISNA(VLOOKUP($K85&M$14,Input!AT76:AT202,1,FALSE)),0,VLOOKUP($K85&M$14,Input!AT76:AU202,2,FALSE))","v":0},{"$f":"IF(ISNA(VLOOKUP($K85&N$14,Input!AT76:AT202,1,FALSE)),0,VLOOKUP($K85&N$14,Input!AT76:AU202,2,FALSE))","v":0},{"$f":"IF(ISNA(VLOOKUP($K85&O$14,Input!AT76:AT202,1,FALSE)),0,1)","v":0},0]
[null,null,null,null,null,null,null,null,null,null,72,{"$f":"IF(ISNA(VLOOKUP($K86&L$14,Input!AT77:AT202,1,FALSE)),\"\",VLOOKUP($K86&L$14,Input!AT77:AW202,4,FALSE))","v":""},{"$f":"IF(ISNA(VLOOKUP($K86&M$14,Input!AT77:AT202,1,FALSE)),0,VLOOKUP($K86&M$14,Input!AT77:AU202,2,FALSE))","v":0},{"$f":"IF(ISNA(VLOOKUP($K86&N$14,Input!AT77:AT202,1,FALSE)),0,VLOOKUP($K86&N$14,Input!AT77:AU202,2,FALSE))","v":0},{"$f":"IF(ISNA(VLOOKUP($K86&O$14,Input!AT77:AT202,1,FALSE)),0,1)","v":0},0]
[null,null,null,null,null,null,null,null,null,null,73,{"$f":"IF(ISNA(VLOOKUP($K87&L$14,Input!AT78:AT202,1,FALSE)),\"\",VLOOKUP($K87&L$14,Input!AT78:AW202,4,FALSE))","v":""},{"$f":"IF(ISNA(VLOOKUP($K87&M$14,Input!AT78:AT202,1,FALSE)),0,VLOOKUP($K87&M$14,Input!AT78:AU202,2,FALSE))","v":0},{"$f":"IF(ISNA(VLOOKUP($K87&N$14,Input!AT78:AT202,1,FALSE)),0,VLOOKUP($K87&N$14,Input!AT78:AU202,2,FALSE))","v":0},{"$f":"IF(ISNA(VLOOKUP($K87&O$14,Input!AT78:AT202,1,FALSE)),0,1)","v":0},0]
[null,null,null,null,null,null,null,null,null,null,74,{"$f":"IF(ISNA(VLOOKUP($K88&L$14,Input!AT79:AT202,1,FALSE)),\"\",VLOOKUP($K88&L$14,Input!AT79:AW202,4,FALSE))","v":""},{"$f":"IF(ISNA(VLOOKUP($K88&M$14,Input!AT79:AT202,1,FALSE)),0,VLOOKUP($K88&M$14,Input!AT79:AU202,2,FALSE))","v":0},{"$f":"IF(ISNA(VLOOKUP($K88&N$14,Input!AT79:AT202,1,FALSE)),0,VLOOKUP($K88&N$14,Input!AT79:AU202,2,FALSE))","v":0},{"$f":"IF(ISNA(VLOOKUP($K88&O$14,Input!AT79:AT202,1,FALSE)),0,1)","v":0},0]
[null,null,null,null,null,null,null,null,null,null,75,{"$f":"IF(ISNA(VLOOKUP($K89&L$14,Input!AT80:AT202,1,FALSE)),\"\",VLOOKUP($K89&L$14,Input!AT80:AW202,4,FALSE))","v":""},{"$f":"IF(ISNA(VLOOKUP($K89&M$14,Input!AT80:AT202,1,FALSE)),0,VLOOKUP($K89&M$14,Input!AT80:AU202,2,FALSE))","v":0},{"$f":"IF(ISNA(VLOOKUP($K89&N$14,Input!AT80:AT202,1,FALSE)),0,VLOOKUP($K89&N$14,Input!AT80:AU202,2,FALSE))","v":0},{"$f":"IF(ISNA(VLOOKUP($K89&O$14,Input!AT80:AT202,1,FALSE)),0,1)","v":0},0]
[null,null,null,null,null,null,null,null,null,null,76,{"$f":"IF(ISNA(VLOOKUP($K90&L$14,Input!AT81:AT202,1,FALSE)),\"\",VLOOKUP($K90&L$14,Input!AT81:AW202,4,FALSE))","v":""},{"$f":"IF(ISNA(VLOOKUP($K90&M$14,Input!AT81:AT202,1,FALSE)),0,VLOOKUP($K90&M$14,Input!AT81:AU202,2,FALSE))","v":0},{"$f":"IF(ISNA(VLOOKUP($K90&N$14,Input!AT81:AT202,1,FALSE)),0,VLOOKUP($K90&N$14,Input!AT81:AU202,2,FALSE))","v":0},{"$f":"IF(ISNA(VLOOKUP($K90&O$14,Input!AT81:AT202,1,FALSE)),0,1)","v":0},0]
[null,null,null,null,null,null,null,null,null,null,77,{"$f":"IF(ISNA(VLOOKUP($K91&L$14,Input!AT82:AT202,1,FALSE)),\"\",VLOOKUP($K91&L$14,Input!AT82:AW202,4,FALSE))","v":""},{"$f":"IF(ISNA(VLOOKUP($K91&M$14,Input!AT82:AT202,1,FALSE)),0,VLOOKUP($K91&M$14,Input!AT82:AU202,2,FALSE))","v":0},{"$f":"IF(ISNA(VLOOKUP($K91&N$14,Input!AT82:AT202,1,FALSE)),0,VLOOKUP($K91&N$14,Input!AT82:AU202,2,FALSE))","v":0},{"$f":"IF(ISNA(VLOOKUP($K91&O$14,Input!AT82:AT202,1,FALSE)),0,1)","v":0},0]
[null,null,null,null,null,null,null,null,null,null,78,{"$f":"IF(ISNA(VLOOKUP($K92&L$14,Input!AT83:AT202,1,FALSE)),\"\",VLOOKUP($K92&L$14,Input!AT83:AW202,4,FALSE))","v":""},{"$f":"IF(ISNA(VLOOKUP($K92&M$14,Input!AT83:AT202,1,FALSE)),0,VLOOKUP($K92&M$14,Input!AT83:AU202,2,FALSE))","v":0},{"$f":"IF(ISNA(VLOOKUP($K92&N$14,Input!AT83:AT202,1,FALSE)),0,VLOOKUP($K92&N$14,Input!AT83:AU202,2,FALSE))","v":0},{"$f":"IF(ISNA(VLOOKUP($K92&O$14,Input!AT83:AT202,1,FALSE)),0,1)","v":0},0]
[null,null,null,null,null,null,null,null,null,null,79,{"$f":"IF(ISNA(VLOOKUP($K93&L$14,Input!AT84:AT202,1,FALSE)),\"\",VLOOKUP($K93&L$14,Input!AT84:AW202,4,FALSE))","v":""},{"$f":"IF(ISNA(VLOOKUP($K93&M$14,Input!AT84:AT202,1,FALSE)),0,VLOOKUP($K93&M$14,Input!AT84:AU202,2,FALSE))","v":0},{"$f":"IF(ISNA(VLOOKUP($K93&N$14,Input!AT84:AT202,1,FALSE)),0,VLOOKUP($K93&N$14,Input!AT84:AU202,2,FALSE))","v":0},{"$f":"IF(ISNA(VLOOKUP($K93&O$14,Input!AT84:AT202,1,FALSE)),0,1)","v":0},0]
[null,null,null,null,null,null,null,null,null,null,80,{"$f":"IF(ISNA(VLOOKUP($K94&L$14,Input!AT85:AT202,1,FALSE)),\"\",VLOOKUP($K94&L$14,Input!AT85:AW202,4,FALSE))","v":""},{"$f":"IF(ISNA(VLOOKUP($K94&M$14,Input!AT85:AT202,1,FALSE)),0,VLOOKUP($K94&M$14,Input!AT85:AU202,2,FALSE))","v":0},{"$f":"IF(ISNA(VLOOKUP($K94&N$14,Input!AT85:AT202,1,FALSE)),0,VLOOKUP($K94&N$14,Input!AT85:AU202,2,FALSE))","v":0},{"$f":"IF(ISNA(VLOOKUP($K94&O$14,Input!AT85:AT202,1,FALSE)),0,1)","v":0},0]
[null,null,null,null,null,null,null,null,null,null,81,{"$f":"IF(ISNA(VLOOKUP($K95&L$14,Input!AT86:AT202,1,FALSE)),\"\",VLOOKUP($K95&L$14,Input!AT86:AW202,4,FALSE))","v":""},{"$f":"IF(ISNA(VLOOKUP($K95&M$14,Input!AT86:AT202,1,FALSE)),0,VLOOKUP($K95&M$14,Input!AT86:AU202,2,FALSE))","v":0},{"$f":"IF(ISNA(VLOOKUP($K95&N$14,Input!AT86:AT202,1,FALSE)),0,VLOOKUP($K95&N$14,Input!AT86:AU202,2,FALSE))","v":0},{"$f":"IF(ISNA(VLOOKUP($K95&O$14,Input!AT86:AT202,1,FALSE)),0,1)","v":0},0]
[null,null,null,null,null,null,null,null,null,null,82,{"$f":"IF(ISNA(VLOOKUP($K96&L$14,Input!AT87:AT202,1,FALSE)),\"\",VLOOKUP($K96&L$14,Input!AT87:AW202,4,FALSE))","v":""},{"$f":"IF(ISNA(VLOOKUP($K96&M$14,Input!AT87:AT202,1,FALSE)),0,VLOOKUP($K96&M$14,Input!AT87:AU202,2,FALSE))","v":0},{"$f":"IF(ISNA(VLOOKUP($K96&N$14,Input!AT87:AT202,1,FALSE)),0,VLOOKUP($K96&N$14,Input!AT87:AU202,2,FALSE))","v":0},{"$f":"IF(ISNA(VLOOKUP($K96&O$14,Input!AT87:AT202,1,FALSE)),0,1)","v":0},0]
[null,null,null,null,null,null,null,null,null,null,83,{"$f":"IF(ISNA(VLOOKUP($K97&L$14,Input!AT88:AT202,1,FALSE)),\"\",VLOOKUP($K97&L$14,Input!AT88:AW202,4,FALSE))","v":""},{"$f":"IF(ISNA(VLOOKUP($K97&M$14,Input!AT88:AT202,1,FALSE)),0,VLOOKUP($K97&M$14,Input!AT88:AU202,2,FALSE))","v":0},{"$f":"IF(ISNA(VLOOKUP($K97&N$14,Input!AT88:AT202,1,FALSE)),0,VLOOKUP($K97&N$14,Input!AT88:AU202,2,FALSE))","v":0},{"$f":"IF(ISNA(VLOOKUP($K97&O$14,Input!AT88:AT202,1,FALSE)),0,1)","v":0},0]
[null,null,null,null,null,null,null,null,null,null,84,{"$f":"IF(ISNA(VLOOKUP($K98&L$14,Input!AT89:AT202,1,FALSE)),\"\",VLOOKUP($K98&L$14,Input!AT89:AW202,4,FALSE))","v":""},{"$f":"IF(ISNA(VLOOKUP($K98&M$14,Input!AT89:AT202,1,FALSE)),0,VLOOKUP($K98&M$14,Input!AT89:AU202,2,FALSE))","v":0},{"$f":"IF(ISNA(VLOOKUP($K98&N$14,Input!AT89:AT202,1,FALSE)),0,VLOOKUP($K98&N$14,Input!AT89:AU202,2,FALSE))","v":0},{"$f":"IF(ISNA(VLOOKUP($K98&O$14,Input!AT89:AT202,1,FALSE)),0,1)","v":0},0]
[null,null,null,null,null,null,null,null,null,null,85,{"$f":"IF(ISNA(VLOOKUP($K99&L$14,Input!AT90:AT202,1,FALSE)),\"\",VLOOKUP($K99&L$14,Input!AT90:AW202,4,FALSE))","v":""},{"$f":"IF(ISNA(VLOOKUP($K99&M$14,Input!AT90:AT202,1,FALSE)),0,VLOOKUP($K99&M$14,Input!AT90:AU202,2,FALSE))","v":0},{"$f":"IF(ISNA(VLOOKUP($K99&N$14,Input!AT90:AT202,1,FALSE)),0,VLOOKUP($K99&N$14,Input!AT90:AU202,2,FALSE))","v":0},{"$f":"IF(ISNA(VLOOKUP($K99&O$14,Input!AT90:AT202,1,FALSE)),0,1)","v":0},0]
[null,null,null,null,null,null,null,null,null,null,86,{"$f":"IF(ISNA(VLOOKUP($K100&L$14,Input!AT91:AT202,1,FALSE)),\"\",VLOOKUP($K100&L$14,Input!AT91:AW202,4,FALSE))","v":""},{"$f":"IF(ISNA(VLOOKUP($K100&M$14,Input!AT91:AT202,1,FALSE)),0,VLOOKUP($K100&M$14,Input!AT91:AU202,2,FALSE))","v":0},{"$f":"IF(ISNA(VLOOKUP($K100&N$14,Input!AT91:AT202,1,FALSE)),0,VLOOKUP($K100&N$14,Input!AT91:AU202,2,FALSE))","v":0},{"$f":"IF(ISNA(VLOOKUP($K100&O$14,Input!AT91:AT202,1,FALSE)),0,1)","v":0},0]
[null,null,null,null,null,null,null,null,null,null,87,{"$f":"IF(ISNA(VLOOKUP($K101&L$14,Input!AT92:AT202,1,FALSE)),\"\",VLOOKUP($K101&L$14,Input!AT92:AW202,4,FALSE))","v":""},{"$f":"IF(ISNA(VLOOKUP($K101&M$14,Input!AT92:AT202,1,FALSE)),0,VLOOKUP($K101&M$14,Input!AT92:AU202,2,FALSE))","v":0},{"$f":"IF(ISNA(VLOOKUP($K101&N$14,Input!AT92:AT202,1,FALSE)),0,VLOOKUP($K101&N$14,Input!AT92:AU202,2,FALSE))","v":0},{"$f":"IF(ISNA(VLOOKUP($K101&O$14,Input!AT92:AT202,1,FALSE)),0,1)","v":0},0]
[null,null,null,null,null,null,null,null,null,null,88,{"$f":"IF(ISNA(VLOOKUP($K102&L$14,Input!AT93:AT202,1,FALSE)),\"\",VLOOKUP($K102&L$14,Input!AT93:AW202,4,FALSE))","v":""},{"$f":"IF(ISNA(VLOOKUP($K102&M$14,Input!AT93:AT202,1,FALSE)),0,VLOOKUP($K102&M$14,Input!AT93:AU202,2,FALSE))","v":0},{"$f":"IF(ISNA(VLOOKUP($K102&N$14,Input!AT93:AT202,1,FALSE)),0,VLOOKUP($K102&N$14,Input!AT93:AU202,2,FALSE))","v":0},{"$f":"IF(ISNA(VLOOKUP($K102&O$14,Input!AT93:AT202,1,FALSE)),0,1)","v":0},0]
[null,null,null,null,null,null,null,null,null,null,89,{"$f":"IF(ISNA(VLOOKUP($K103&L$14,Input!AT94:AT202,1,FALSE)),\"\",VLOOKUP($K103&L$14,Input!AT94:AW202,4,FALSE))","v":""},{"$f":"IF(ISNA(VLOOKUP($K103&M$14,Input!AT94:AT202,1,FALSE)),0,VLOOKUP($K103&M$14,Input!AT94:AU202,2,FALSE))","v":0},{"$f":"IF(ISNA(VLOOKUP($K103&N$14,Input!AT94:AT202,1,FALSE)),0,VLOOKUP($K103&N$14,Input!AT94:AU202,2,FALSE))","v":0},{"$f":"IF(ISNA(VLOOKUP($K103&O$14,Input!AT94:AT202,1,FALSE)),0,1)","v":0},0]
[null,null,null,null,null,null,null,null,null,null,90,{"$f":"IF(ISNA(VLOOKUP($K104&L$14,Input!AT95:AT202,1,FALSE)),\"\",VLOOKUP($K104&L$14,Input!AT95:AW202,4,FALSE))","v":""},{"$f":"IF(ISNA(VLOOKUP($K104&M$14,Input!AT95:AT202,1,FALSE)),0,VLOOKUP($K104&M$14,Input!AT95:AU202,2,FALSE))","v":0},{"$f":"IF(ISNA(VLOOKUP($K104&N$14,Input!AT95:AT202,1,FALSE)),0,VLOOKUP($K104&N$14,Input!AT95:AU202,2,FALSE))","v":0},{"$f":"IF(ISNA(VLOOKUP($K104&O$14,Input!AT95:AT202,1,FALSE)),0,1)","v":0},0]
[null,null,null,null,null,null,null,null,null,null,91,{"$f":"IF(ISNA(VLOOKUP($K105&L$14,Input!AT96:AT202,1,FALSE)),\"\",VLOOKUP($K105&L$14,Input!AT96:AW202,4,FALSE))","v":""},{"$f":"IF(ISNA(VLOOKUP($K105&M$14,Input!AT96:AT202,1,FALSE)),0,VLOOKUP($K105&M$14,Input!AT96:AU202,2,FALSE))","v":0},{"$f":"IF(ISNA(VLOOKUP($K105&N$14,Input!AT96:AT202,1,FALSE)),0,VLOOKUP($K105&N$14,Input!AT96:AU202,2,FALSE))","v":0},{"$f":"IF(ISNA(VLOOKUP($K105&O$14,Input!AT96:AT202,1,FALSE)),0,1)","v":0},0]
[null,null,null,null,null,null,null,null,null,null,92,{"$f":"IF(ISNA(VLOOKUP($K106&L$14,Input!AT97:AT202,1,FALSE)),\"\",VLOOKUP($K106&L$14,Input!AT97:AW202,4,FALSE))","v":""},{"$f":"IF(ISNA(VLOOKUP($K106&M$14,Input!AT97:AT202,1,FALSE)),0,VLOOKUP($K106&M$14,Input!AT97:AU202,2,FALSE))","v":0},{"$f":"IF(ISNA(VLOOKUP($K106&N$14,Input!AT97:AT202,1,FALSE)),0,VLOOKUP($K106&N$14,Input!AT97:AU202,2,FALSE))","v":0},{"$f":"IF(ISNA(VLOOKUP($K106&O$14,Input!AT97:AT202,1,FALSE)),0,1)","v":0},0]
[null,null,null,null,null,null,null,null,null,null,93,{"$f":"IF(ISNA(VLOOKUP($K107&L$14,Input!AT98:AT202,1,FALSE)),\"\",VLOOKUP($K107&L$14,Input!AT98:AW202,4,FALSE))","v":""},{"$f":"IF(ISNA(VLOOKUP($K107&M$14,Input!AT98:AT202,1,FALSE)),0,VLOOKUP($K107&M$14,Input!AT98:AU202,2,FALSE))","v":0},{"$f":"IF(ISNA(VLOOKUP($K107&N$14,Input!AT98:AT202,1,FALSE)),0,VLOOKUP($K107&N$14,Input!AT98:AU202,2,FALSE))","v":0},{"$f":"IF(ISNA(VLOOKUP($K107&O$14,Input!AT98:AT202,1,FALSE)),0,1)","v":0},0]
[null,null,null,null,null,null,null,null,null,null,94,{"$f":"IF(ISNA(VLOOKUP($K108&L$14,Input!AT99:AT202,1,FALSE)),\"\",VLOOKUP($K108&L$14,Input!AT99:AW202,4,FALSE))","v":""},{"$f":"IF(ISNA(VLOOKUP($K108&M$14,Input!AT99:AT202,1,FALSE)),0,VLOOKUP($K108&M$14,Input!AT99:AU202,2,FALSE))","v":0},{"$f":"IF(ISNA(VLOOKUP($K108&N$14,Input!AT99:AT202,1,FALSE)),0,VLOOKUP($K108&N$14,Input!AT99:AU202,2,FALSE))","v":0},{"$f":"IF(ISNA(VLOOKUP($K108&O$14,Input!AT99:AT202,1,FALSE)),0,1)","v":0},0]
[null,null,null,null,null,null,null,null,null,null,95,{"$f":"IF(ISNA(VLOOKUP($K109&L$14,Input!AT100:AT202,1,FALSE)),\"\",VLOOKUP($K109&L$14,Input!AT100:AW202,4,FALSE))","v":""},{"$f":"IF(ISNA(VLOOKUP($K109&M$14,Input!AT100:AT202,1,FALSE)),0,VLOOKUP($K109&M$14,Input!AT100:AU202,2,FALSE))","v":0},{"$f":"IF(ISNA(VLOOKUP($K109&N$14,Input!AT100:AT202,1,FALSE)),0,VLOOKUP($K109&N$14,Input!AT100:AU202,2,FALSE))","v":0},{"$f":"IF(ISNA(VLOOKUP($K109&O$14,Input!AT100:AT202,1,FALSE)),0,1)","v":0},0]
[null,null,null,null,null,null,null,null,null,null,96,{"$f":"IF(ISNA(VLOOKUP($K110&L$14,Input!AT101:AT202,1,FALSE)),\"\",VLOOKUP($K110&L$14,Input!AT101:AW202,4,FALSE))","v":""},{"$f":"IF(ISNA(VLOOKUP($K110&M$14,Input!AT101:AT202,1,FALSE)),0,VLOOKUP($K110&M$14,Input!AT101:AU202,2,FALSE))","v":0},{"$f":"IF(ISNA(VLOOKUP($K110&N$14,Input!AT101:AT202,1,FALSE)),0,VLOOKUP($K110&N$14,Input!AT101:AU202,2,FALSE))","v":0},{"$f":"IF(ISNA(VLOOKUP($K110&O$14,Input!AT101:AT202,1,FALSE)),0,1)","v":0},0]
[null,null,null,null,null,null,null,null,null,null,97,{"$f":"IF(ISNA(VLOOKUP($K111&L$14,Input!AT102:AT202,1,FALSE)),\"\",VLOOKUP($K111&L$14,Input!AT102:AW202,4,FALSE))","v":""},{"$f":"IF(ISNA(VLOOKUP($K111&M$14,Input!AT102:AT202,1,FALSE)),0,VLOOKUP($K111&M$14,Input!AT102:AU202,2,FALSE))","v":0},{"$f":"IF(ISNA(VLOOKUP($K111&N$14,Input!AT102:AT202,1,FALSE)),0,VLOOKUP($K111&N$14,Input!AT102:AU202,2,FALSE))","v":0},{"$f":"IF(ISNA(VLOOKUP($K111&O$14,Input!AT102:AT202,1,FALSE)),0,1)","v":0},0]
[null,null,null,null,null,null,null,null,null,null,98,{"$f":"IF(ISNA(VLOOKUP($K112&L$14,Input!AT103:AT202,1,FALSE)),\"\",VLOOKUP($K112&L$14,Input!AT103:AW202,4,FALSE))","v":""},{"$f":"IF(ISNA(VLOOKUP($K112&M$14,Input!AT103:AT202,1,FALSE)),0,VLOOKUP($K112&M$14,Input!AT103:AU202,2,FALSE))","v":0},{"$f":"IF(ISNA(VLOOKUP($K112&N$14,Input!AT103:AT202,1,FALSE)),0,VLOOKUP($K112&N$14,Input!AT103:AU202,2,FALSE))","v":0},{"$f":"IF(ISNA(VLOOKUP($K112&O$14,Input!AT103:AT202,1,FALSE)),0,1)","v":0},0]
[null,null,null,null,null,null,null,null,null,null,99,{"$f":"IF(ISNA(VLOOKUP($K113&L$14,Input!AT104:AT202,1,FALSE)),\"\",VLOOKUP($K113&L$14,Input!AT104:AW202,4,FALSE))","v":""},{"$f":"IF(ISNA(VLOOKUP($K113&M$14,Input!AT104:AT202,1,FALSE)),0,VLOOKUP($K113&M$14,Input!AT104:AU202,2,FALSE))","v":0},{"$f":"IF(ISNA(VLOOKUP($K113&N$14,Input!AT104:AT202,1,FALSE)),0,VLOOKUP($K113&N$14,Input!AT104:AU202,2,FALSE))","v":0},{"$f":"IF(ISNA(VLOOKUP($K113&O$14,Input!AT104:AT202,1,FALSE)),0,1)","v":0},0]
[null,null,null,null,null,null,null,null,null,null,100,{"$f":"IF(ISNA(VLOOKUP($K114&L$14,Input!AT105:AT202,1,FALSE)),\"\",VLOOKUP($K114&L$14,Input!AT105:AW202,4,FALSE))","v":""},{"$f":"IF(ISNA(VLOOKUP($K114&M$14,Input!AT105:AT202,1,FALSE)),0,VLOOKUP($K114&M$14,Input!AT105:AU202,2,FALSE))","v":0},{"$f":"IF(ISNA(VLOOKUP($K114&N$14,Input!AT105:AT202,1,FALSE)),0,VLOOKUP($K114&N$14,Input!AT105:AU202,2,FALSE))","v":0},{"$f":"IF(ISNA(VLOOKUP($K114&O$14,Input!AT105:AT202,1,FALSE)),0,1)","v":0},0]
[null,null,null,null,null,null,null,null,null,null,101,{"$f":"IF(ISNA(VLOOKUP($K115&L$14,Input!AT106:AT202,1,FALSE)),\"\",VLOOKUP($K115&L$14,Input!AT106:AW202,4,FALSE))","v":""},{"$f":"IF(ISNA(VLOOKUP($K115&M$14,Input!AT106:AT202,1,FALSE)),0,VLOOKUP($K115&M$14,Input!AT106:AU202,2,FALSE))","v":0},{"$f":"IF(ISNA(VLOOKUP($K115&N$14,Input!AT106:AT202,1,FALSE)),0,VLOOKUP($K115&N$14,Input!AT106:AU202,2,FALSE))","v":0},{"$f":"IF(ISNA(VLOOKUP($K115&O$14,Input!AT106:AT202,1,FALSE)),0,1)","v":0},0]
[null,null,null,null,null,null,null,null,null,null,102,{"$f":"IF(ISNA(VLOOKUP($K116&L$14,Input!AT107:AT202,1,FALSE)),\"\",VLOOKUP($K116&L$14,Input!AT107:AW202,4,FALSE))","v":""},{"$f":"IF(ISNA(VLOOKUP($K116&M$14,Input!AT107:AT202,1,FALSE)),0,VLOOKUP($K116&M$14,Input!AT107:AU202,2,FALSE))","v":0},{"$f":"IF(ISNA(VLOOKUP($K116&N$14,Input!AT107:AT202,1,FALSE)),0,VLOOKUP($K116&N$14,Input!AT107:AU202,2,FALSE))","v":0},{"$f":"IF(ISNA(VLOOKUP($K116&O$14,Input!AT107:AT202,1,FALSE)),0,1)","v":0},0]
[null,null,null,null,null,null,null,null,null,null,103,{"$f":"IF(ISNA(VLOOKUP($K117&L$14,Input!AT108:AT202,1,FALSE)),\"\",VLOOKUP($K117&L$14,Input!AT108:AW202,4,FALSE))","v":""},{"$f":"IF(ISNA(VLOOKUP($K117&M$14,Input!AT108:AT202,1,FALSE)),0,VLOOKUP($K117&M$14,Input!AT108:AU202,2,FALSE))","v":0},{"$f":"IF(ISNA(VLOOKUP($K117&N$14,Input!AT108:AT202,1,FALSE)),0,VLOOKUP($K117&N$14,Input!AT108:AU202,2,FALSE))","v":0},{"$f":"IF(ISNA(VLOOKUP($K117&O$14,Input!AT108:AT202,1,FALSE)),0,1)","v":0},0]
[null,null,null,null,null,null,null,null,null,null,104,{"$f":"IF(ISNA(VLOOKUP($K118&L$14,Input!AT109:AT203,1,FALSE)),\"\",VLOOKUP($K118&L$14,Input!AT109:AW203,4,FALSE))","v":""},{"$f":"IF(ISNA(VLOOKUP($K118&M$14,Input!AT109:AT203,1,FALSE)),0,VLOOKUP($K118&M$14,Input!AT109:AU203,2,FALSE))","v":0},{"$f":"IF(ISNA(VLOOKUP($K118&N$14,Input!AT109:AT203,1,FALSE)),0,VLOOKUP($K118&N$14,Input!AT109:AU203,2,FALSE))","v":0},{"$f":"IF(ISNA(VLOOKUP($K118&O$14,Input!AT109:AT203,1,FALSE)),0,1)","v":0},0]
[null,null,null,null,null,null,null,null,null,null,105,{"$f":"IF(ISNA(VLOOKUP($K119&L$14,Input!AT110:AT204,1,FALSE)),\"\",VLOOKUP($K119&L$14,Input!AT110:AW204,4,FALSE))","v":""},{"$f":"IF(ISNA(VLOOKUP($K119&M$14,Input!AT110:AT204,1,FALSE)),0,VLOOKUP($K119&M$14,Input!AT110:AU204,2,FALSE))","v":0},{"$f":"IF(ISNA(VLOOKUP($K119&N$14,Input!AT110:AT204,1,FALSE)),0,VLOOKUP($K119&N$14,Input!AT110:AU204,2,FALSE))","v":0},{"$f":"IF(ISNA(VLOOKUP($K119&O$14,Input!AT110:AT204,1,FALSE)),0,1)","v":0},0]
[null,null,null,null,null,null,null,null,null,null,106,{"$f":"IF(ISNA(VLOOKUP($K120&L$14,Input!AT111:AT205,1,FALSE)),\"\",VLOOKUP($K120&L$14,Input!AT111:AW205,4,FALSE))","v":""},{"$f":"IF(ISNA(VLOOKUP($K120&M$14,Input!AT111:AT205,1,FALSE)),0,VLOOKUP($K120&M$14,Input!AT111:AU205,2,FALSE))","v":0},{"$f":"IF(ISNA(VLOOKUP($K120&N$14,Input!AT111:AT205,1,FALSE)),0,VLOOKUP($K120&N$14,Input!AT111:AU205,2,FALSE))","v":0},{"$f":"IF(ISNA(VLOOKUP($K120&O$14,Input!AT111:AT205,1,FALSE)),0,1)","v":0},0]
[null,null,null,null,null,null,null,null,null,null,107,{"$f":"IF(ISNA(VLOOKUP($K121&L$14,Input!AT112:AT206,1,FALSE)),\"\",VLOOKUP($K121&L$14,Input!AT112:AW206,4,FALSE))","v":""},{"$f":"IF(ISNA(VLOOKUP($K121&M$14,Input!AT112:AT206,1,FALSE)),0,VLOOKUP($K121&M$14,Input!AT112:AU206,2,FALSE))","v":0},{"$f":"IF(ISNA(VLOOKUP($K121&N$14,Input!AT112:AT206,1,FALSE)),0,VLOOKUP($K121&N$14,Input!AT112:AU206,2,FALSE))","v":0},{"$f":"IF(ISNA(VLOOKUP($K121&O$14,Input!AT112:AT206,1,FALSE)),0,1)","v":0},0]
[null,null,null,null,null,null,null,null,null,null,108,{"$f":"IF(ISNA(VLOOKUP($K122&L$14,Input!AT113:AT207,1,FALSE)),\"\",VLOOKUP($K122&L$14,Input!AT113:AW207,4,FALSE))","v":""},{"$f":"IF(ISNA(VLOOKUP($K122&M$14,Input!AT113:AT207,1,FALSE)),0,VLOOKUP($K122&M$14,Input!AT113:AU207,2,FALSE))","v":0},{"$f":"IF(ISNA(VLOOKUP($K122&N$14,Input!AT113:AT207,1,FALSE)),0,VLOOKUP($K122&N$14,Input!AT113:AU207,2,FALSE))","v":0},{"$f":"IF(ISNA(VLOOKUP($K122&O$14,Input!AT113:AT207,1,FALSE)),0,1)","v":0},0]
[null,null,null,null,null,null,null,null,null,null,109,{"$f":"IF(ISNA(VLOOKUP($K123&L$14,Input!AT114:AT208,1,FALSE)),\"\",VLOOKUP($K123&L$14,Input!AT114:AW208,4,FALSE))","v":""},{"$f":"IF(ISNA(VLOOKUP($K123&M$14,Input!AT114:AT208,1,FALSE)),0,VLOOKUP($K123&M$14,Input!AT114:AU208,2,FALSE))","v":0},{"$f":"IF(ISNA(VLOOKUP($K123&N$14,Input!AT114:AT208,1,FALSE)),0,VLOOKUP($K123&N$14,Input!AT114:AU208,2,FALSE))","v":0},{"$f":"IF(ISNA(VLOOKUP($K123&O$14,Input!AT114:AT208,1,FALSE)),0,1)","v":0},0]
[null,null,null,null,null,null,null,null,null,null,110,{"$f":"IF(ISNA(VLOOKUP($K124&L$14,Input!AT115:AT209,1,FALSE)),\"\",VLOOKUP($K124&L$14,Input!AT115:AW209,4,FALSE))","v":""},{"$f":"IF(ISNA(VLOOKUP($K124&M$14,Input!AT115:AT209,1,FALSE)),0,VLOOKUP($K124&M$14,Input!AT115:AU209,2,FALSE))","v":0},{"$f":"IF(ISNA(VLOOKUP($K124&N$14,Input!AT115:AT209,1,FALSE)),0,VLOOKUP($K124&N$14,Input!AT115:AU209,2,FALSE))","v":0},{"$f":"IF(ISNA(VLOOKUP($K124&O$14,Input!AT115:AT209,1,FALSE)),0,1)","v":0},0]
[null,null,null,null,null,null,null,null,null,null,111,{"$f":"IF(ISNA(VLOOKUP($K125&L$14,Input!AT116:AT210,1,FALSE)),\"\",VLOOKUP($K125&L$14,Input!AT116:AW210,4,FALSE))","v":""},{"$f":"IF(ISNA(VLOOKUP($K125&M$14,Input!AT116:AT210,1,FALSE)),0,VLOOKUP($K125&M$14,Input!AT116:AU210,2,FALSE))","v":0},{"$f":"IF(ISNA(VLOOKUP($K125&N$14,Input!AT116:AT210,1,FALSE)),0,VLOOKUP($K125&N$14,Input!AT116:AU210,2,FALSE))","v":0},{"$f":"IF(ISNA(VLOOKUP($K125&O$14,Input!AT116:AT210,1,FALSE)),0,1)","v":0},0]
[null,null,null,null,null,null,null,null,null,null,112,{"$f":"IF(ISNA(VLOOKUP($K126&L$14,Input!AT117:AT211,1,FALSE)),\"\",VLOOKUP($K126&L$14,Input!AT117:AW211,4,FALSE))","v":""},{"$f":"IF(ISNA(VLOOKUP($K126&M$14,Input!AT117:AT211,1,FALSE)),0,VLOOKUP($K126&M$14,Input!AT117:AU211,2,FALSE))","v":0},{"$f":"IF(ISNA(VLOOKUP($K126&N$14,Input!AT117:AT211,1,FALSE)),0,VLOOKUP($K126&N$14,Input!AT117:AU211,2,FALSE))","v":0},{"$f":"IF(ISNA(VLOOKUP($K126&O$14,Input!AT117:AT211,1,FALSE)),0,1)","v":0},0]
[null,null,null,null,null,null,null,null,null,null,113,{"$f":"IF(ISNA(VLOOKUP($K127&L$14,Input!AT118:AT212,1,FALSE)),\"\",VLOOKUP($K127&L$14,Input!AT118:AW212,4,FALSE))","v":""},{"$f":"IF(ISNA(VLOOKUP($K127&M$14,Input!AT118:AT212,1,FALSE)),0,VLOOKUP($K127&M$14,Input!AT118:AU212,2,FALSE))","v":0},{"$f":"IF(ISNA(VLOOKUP($K127&N$14,Input!AT118:AT212,1,FALSE)),0,VLOOKUP($K127&N$14,Input!AT118:AU212,2,FALSE))","v":0},{"$f":"IF(ISNA(VLOOKUP($K127&O$14,Input!AT118:AT212,1,FALSE)),0,1)","v":0},0]
[null,null,null,null,null,null,null,null,null,null,114,{"$f":"IF(ISNA(VLOOKUP($K128&L$14,Input!AT119:AT213,1,FALSE)),\"\",VLOOKUP($K128&L$14,Input!AT119:AW213,4,FALSE))","v":""},{"$f":"IF(ISNA(VLOOKUP($K128&M$14,Input!AT119:AT213,1,FALSE)),0,VLOOKUP($K128&M$14,Input!AT119:AU213,2,FALSE))","v":0},{"$f":"IF(ISNA(VLOOKUP($K128&N$14,Input!AT119:AT213,1,FALSE)),0,VLOOKUP($K128&N$14,Input!AT119:AU213,2,FALSE))","v":0},{"$f":"IF(ISNA(VLOOKUP($K128&O$14,Input!AT119:AT213,1,FALSE)),0,1)","v":0},0]
[null,null,null,null,null,null,null,null,null,null,115,{"$f":"IF(ISNA(VLOOKUP($K129&L$14,Input!AT120:AT214,1,FALSE)),\"\",VLOOKUP($K129&L$14,Input!AT120:AW214,4,FALSE))","v":""},{"$f":"IF(ISNA(VLOOKUP($K129&M$14,Input!AT120:AT214,1,FALSE)),0,VLOOKUP($K129&M$14,Input!AT120:AU214,2,FALSE))","v":0},{"$f":"IF(ISNA(VLOOKUP($K129&N$14,Input!AT120:AT214,1,FALSE)),0,VLOOKUP($K129&N$14,Input!AT120:AU214,2,FALSE))","v":0},{"$f":"IF(ISNA(VLOOKUP($K129&O$14,Input!AT120:AT214,1,FALSE)),0,1)","v":0},{"$f":"IF(M129=0,0,1)+IF(N129=0,0,2)+IF(O129=0,0,4)","v":0}]
[null,null,null,null,null,null,null,null,null,null,116,{"$f":"IF(ISNA(VLOOKUP($K130&L$14,Input!AT121:AT215,1,FALSE)),\"\",VLOOKUP($K130&L$14,Input!AT121:AW215,4,FALSE))","v":""},{"$f":"IF(ISNA(VLOOKUP($K130&M$14,Input!AT121:AT215,1,FALSE)),0,VLOOKUP($K130&M$14,Input!AT121:AU215,2,FALSE))","v":0},{"$f":"IF(ISNA(VLOOKUP($K130&N$14,Input!AT121:AT215,1,FALSE)),0,VLOOKUP($K130&N$14,Input!AT121:AU215,2,FALSE))","v":0},{"$f":"IF(ISNA(VLOOKUP($K130&O$14,Input!AT121:AT215,1,FALSE)),0,1)","v":0},0]
[null,null,null,null,null,null,null,null,null,null,117,{"$f":"IF(ISNA(VLOOKUP($K131&L$14,Input!AT122:AT216,1,FALSE)),\"\",VLOOKUP($K131&L$14,Input!AT122:AW216,4,FALSE))","v":""},{"$f":"IF(ISNA(VLOOKUP($K131&M$14,Input!AT122:AT216,1,FALSE)),0,VLOOKUP($K131&M$14,Input!AT122:AU216,2,FALSE))","v":0},{"$f":"IF(ISNA(VLOOKUP($K131&N$14,Input!AT122:AT216,1,FALSE)),0,VLOOKUP($K131&N$14,Input!AT122:AU216,2,FALSE))","v":0},{"$f":"IF(ISNA(VLOOKUP($K131&O$14,Input!AT122:AT216,1,FALSE)),0,1)","v":0},0]
[null,null,null,null,null,null,null,null,null,null,118,{"$f":"IF(ISNA(VLOOKUP($K132&L$14,Input!AT123:AT217,1,FALSE)),\"\",VLOOKUP($K132&L$14,Input!AT123:AW217,4,FALSE))","v":""},{"$f":"IF(ISNA(VLOOKUP($K132&M$14,Input!AT123:AT217,1,FALSE)),0,VLOOKUP($K132&M$14,Input!AT123:AU217,2,FALSE))","v":0},{"$f":"IF(ISNA(VLOOKUP($K132&N$14,Input!AT123:AT217,1,FALSE)),0,VLOOKUP($K132&N$14,Input!AT123:AU217,2,FALSE))","v":0},{"$f":"IF(ISNA(VLOOKUP($K132&O$14,Input!AT123:AT217,1,FALSE)),0,1)","v":0},0]
[null,null,null,null,null,null,null,null,null,null,119,{"$f":"IF(ISNA(VLOOKUP($K133&L$14,Input!AT124:AT218,1,FALSE)),\"\",VLOOKUP($K133&L$14,Input!AT124:AW218,4,FALSE))","v":""},{"$f":"IF(ISNA(VLOOKUP($K133&M$14,Input!AT124:AT218,1,FALSE)),0,VLOOKUP($K133&M$14,Input!AT124:AU218,2,FALSE))","v":0},{"$f":"IF(ISNA(VLOOKUP($K133&N$14,Input!AT124:AT218,1,FALSE)),0,VLOOKUP($K133&N$14,Input!AT124:AU218,2,FALSE))","v":0},{"$f":"IF(ISNA(VLOOKUP($K133&O$14,Input!AT124:AT218,1,FALSE)),0,1)","v":0},0]
[null,null,null,null,null,null,null,null,null,null,120,{"$f":"IF(ISNA(VLOOKUP($K134&L$14,Input!AT125:AT219,1,FALSE)),\"\",VLOOKUP($K134&L$14,Input!AT125:AW219,4,FALSE))","v":""},{"$f":"IF(ISNA(VLOOKUP($K134&M$14,Input!AT125:AT219,1,FALSE)),0,VLOOKUP($K134&M$14,Input!AT125:AU219,2,FALSE))","v":0},{"$f":"IF(ISNA(VLOOKUP($K134&N$14,Input!AT125:AT219,1,FALSE)),0,VLOOKUP($K134&N$14,Input!AT125:AU219,2,FALSE))","v":0},{"$f":"IF(ISNA(VLOOKUP($K134&O$14,Input!AT125:AT219,1,FALSE)),0,1)","v":0},0]
[null,null,null,null,null,null,null,null,null,null,121,{"$f":"IF(ISNA(VLOOKUP($K135&L$14,Input!AT126:AT220,1,FALSE)),\"\",VLOOKUP($K135&L$14,Input!AT126:AW220,4,FALSE))","v":""},{"$f":"IF(ISNA(VLOOKUP($K135&M$14,Input!AT126:AT220,1,FALSE)),0,VLOOKUP($K135&M$14,Input!AT126:AU220,2,FALSE))","v":0},{"$f":"IF(ISNA(VLOOKUP($K135&N$14,Input!AT126:AT220,1,FALSE)),0,VLOOKUP($K135&N$14,Input!AT126:AU220,2,FALSE))","v":0},{"$f":"IF(ISNA(VLOOKUP($K135&O$14,Input!AT126:AT220,1,FALSE)),0,1)","v":0},0]
[null,null,null,null,null,null,null,null,null,null,122,{"$f":"IF(ISNA(VLOOKUP($K136&L$14,Input!AT127:AT221,1,FALSE)),\"\",VLOOKUP($K136&L$14,Input!AT127:AW221,4,FALSE))","v":""},{"$f":"IF(ISNA(VLOOKUP($K136&M$14,Input!AT127:AT221,1,FALSE)),0,VLOOKUP($K136&M$14,Input!AT127:AU221,2,FALSE))","v":0},{"$f":"IF(ISNA(VLOOKUP($K136&N$14,Input!AT127:AT221,1,FALSE)),0,VLOOKUP($K136&N$14,Input!AT127:AU221,2,FALSE))","v":0},{"$f":"IF(ISNA(VLOOKUP($K136&O$14,Input!AT127:AT221,1,FALSE)),0,1)","v":0},0]
[null,null,null,null,null,null,null,null,null,null,123,{"$f":"IF(ISNA(VLOOKUP($K137&L$14,Input!AT128:AT222,1,FALSE)),\"\",VLOOKUP($K137&L$14,Input!AT128:AW222,4,FALSE))","v":""},{"$f":"IF(ISNA(VLOOKUP($K137&M$14,Input!AT128:AT222,1,FALSE)),0,VLOOKUP($K137&M$14,Input!AT128:AU222,2,FALSE))","v":0},{"$f":"IF(ISNA(VLOOKUP($K137&N$14,Input!AT128:AT222,1,FALSE)),0,VLOOKUP($K137&N$14,Input!AT128:AU222,2,FALSE))","v":0},{"$f":"IF(ISNA(VLOOKUP($K137&O$14,Input!AT128:AT222,1,FALSE)),0,1)","v":0},0]
[null,null,null,null,null,null,null,null,null,null,124,{"$f":"IF(ISNA(VLOOKUP($K138&L$14,Input!AT129:AT223,1,FALSE)),\"\",VLOOKUP($K138&L$14,Input!AT129:AW223,4,FALSE))","v":""},{"$f":"IF(ISNA(VLOOKUP($K138&M$14,Input!AT129:AT223,1,FALSE)),0,VLOOKUP($K138&M$14,Input!AT129:AU223,2,FALSE))","v":0},{"$f":"IF(ISNA(VLOOKUP($K138&N$14,Input!AT129:AT223,1,FALSE)),0,VLOOKUP($K138&N$14,Input!AT129:AU223,2,FALSE))","v":0},{"$f":"IF(ISNA(VLOOKUP($K138&O$14,Input!AT129:AT223,1,FALSE)),0,1)","v":0},0]
[null,null,null,null,null,null,null,null,null,null,125,{"$f":"IF(ISNA(VLOOKUP($K139&L$14,Input!AT130:AT224,1,FALSE)),\"\",VLOOKUP($K139&L$14,Input!AT130:AW224,4,FALSE))","v":""},{"$f":"IF(ISNA(VLOOKUP($K139&M$14,Input!AT130:AT224,1,FALSE)),0,VLOOKUP($K139&M$14,Input!AT130:AU224,2,FALSE))","v":0},{"$f":"IF(ISNA(VLOOKUP($K139&N$14,Input!AT130:AT224,1,FALSE)),0,VLOOKUP($K139&N$14,Input!AT130:AU224,2,FALSE))","v":0},{"$f":"IF(ISNA(VLOOKUP($K139&O$14,Input!AT130:AT224,1,FALSE)),0,1)","v":0},0]
[null,null,null,null,null,null,null,null,null,null,126,{"$f":"IF(ISNA(VLOOKUP($K140&L$14,Input!AT131:AT225,1,FALSE)),\"\",VLOOKUP($K140&L$14,Input!AT131:AW225,4,FALSE))","v":""},{"$f":"IF(ISNA(VLOOKUP($K140&M$14,Input!AT131:AT225,1,FALSE)),0,VLOOKUP($K140&M$14,Input!AT131:AU225,2,FALSE))","v":0},{"$f":"IF(ISNA(VLOOKUP($K140&N$14,Input!AT131:AT225,1,FALSE)),0,VLOOKUP($K140&N$14,Input!AT131:AU225,2,FALSE))","v":0},{"$f":"IF(ISNA(VLOOKUP($K140&O$14,Input!AT131:AT225,1,FALSE)),0,1)","v":0},0]
[null,null,null,null,null,null,null,null,null,null,127,{"$f":"IF(ISNA(VLOOKUP($K141&L$14,Input!AT132:AT226,1,FALSE)),\"\",VLOOKUP($K141&L$14,Input!AT132:AW226,4,FALSE))","v":""},{"$f":"IF(ISNA(VLOOKUP($K141&M$14,Input!AT132:AT226,1,FALSE)),0,VLOOKUP($K141&M$14,Input!AT132:AU226,2,FALSE))","v":0},{"$f":"IF(ISNA(VLOOKUP($K141&N$14,Input!AT132:AT226,1,FALSE)),0,VLOOKUP($K141&N$14,Input!AT132:AU226,2,FALSE))","v":0},{"$f":"IF(ISNA(VLOOKUP($K141&O$14,Input!AT132:AT226,1,FALSE)),0,1)","v":0},0]
[null,null,null,null,null,null,null,null,null,null,128,{"$f":"IF(ISNA(VLOOKUP($K142&L$14,Input!AT133:AT227,1,FALSE)),\"\",VLOOKUP($K142&L$14,Input!AT133:AW227,4,FALSE))","v":""},{"$f":"IF(ISNA(VLOOKUP($K142&M$14,Input!AT133:AT227,1,FALSE)),0,VLOOKUP($K142&M$14,Input!AT133:AU227,2,FALSE))","v":0},{"$f":"IF(ISNA(VLOOKUP($K142&N$14,Input!AT133:AT227,1,FALSE)),0,VLOOKUP($K142&N$14,Input!AT133:AU227,2,FALSE))","v":0},{"$f":"IF(ISNA(VLOOKUP($K142&O$14,Input!AT133:AT227,1,FALSE)),0,1)","v":0},0]
[null,null,null,null,null,null,null,null,null,null,129,{"$f":"IF(ISNA(VLOOKUP($K143&L$14,Input!AT134:AT228,1,FALSE)),\"\",VLOOKUP($K143&L$14,Input!AT134:AW228,4,FALSE))","v":""},{"$f":"IF(ISNA(VLOOKUP($K143&M$14,Input!AT134:AT228,1,FALSE)),0,VLOOKUP($K143&M$14,Input!AT134:AU228,2,FALSE))","v":0},{"$f":"IF(ISNA(VLOOKUP($K143&N$14,Input!AT134:AT228,1,FALSE)),0,VLOOKUP($K143&N$14,Input!AT134:AU228,2,FALSE))","v":0},{"$f":"IF(ISNA(VLOOKUP($K143&O$14,Input!AT134:AT228,1,FALSE)),0,1)","v":0},0]
[null,null,null,null,null,null,null,null,null,null,130,{"$f":"IF(ISNA(VLOOKUP($K144&L$14,Input!AT135:AT229,1,FALSE)),\"\",VLOOKUP($K144&L$14,Input!AT135:AW229,4,FALSE))","v":""},{"$f":"IF(ISNA(VLOOKUP($K144&M$14,Input!AT135:AT229,1,FALSE)),0,VLOOKUP($K144&M$14,Input!AT135:AU229,2,FALSE))","v":0},{"$f":"IF(ISNA(VLOOKUP($K144&N$14,Input!AT135:AT229,1,FALSE)),0,VLOOKUP($K144&N$14,Input!AT135:AU229,2,FALSE))","v":0},{"$f":"IF(ISNA(VLOOKUP($K144&O$14,Input!AT135:AT229,1,FALSE)),0,1)","v":0},0]
[null,null,null,null,null,null,null,null,null,null,131,{"$f":"IF(ISNA(VLOOKUP($K145&L$14,Input!AT136:AT230,1,FALSE)),\"\",VLOOKUP($K145&L$14,Input!AT136:AW230,4,FALSE))","v":""},{"$f":"IF(ISNA(VLOOKUP($K145&M$14,Input!AT136:AT230,1,FALSE)),0,VLOOKUP($K145&M$14,Input!AT136:AU230,2,FALSE))","v":0},{"$f":"IF(ISNA(VLOOKUP($K145&N$14,Input!AT136:AT230,1,FALSE)),0,VLOOKUP($K145&N$14,Input!AT136:AU230,2,FALSE))","v":0},{"$f":"IF(ISNA(VLOOKUP($K145&O$14,Input!AT136:AT230,1,FALSE)),0,1)","v":0},0]
[null,null,null,null,null,null,null,null,null,null,132,{"$f":"IF(ISNA(VLOOKUP($K146&L$14,Input!AT137:AT231,1,FALSE)),\"\",VLOOKUP($K146&L$14,Input!AT137:AW231,4,FALSE))","v":""},{"$f":"IF(ISNA(VLOOKUP($K146&M$14,Input!AT137:AT231,1,FALSE)),0,VLOOKUP($K146&M$14,Input!AT137:AU231,2,FALSE))","v":0},{"$f":"IF(ISNA(VLOOKUP($K146&N$14,Input!AT137:AT231,1,FALSE)),0,VLOOKUP($K146&N$14,Input!AT137:AU231,2,FALSE))","v":0},{"$f":"IF(ISNA(VLOOKUP($K146&O$14,Input!AT137:AT231,1,FALSE)),0,1)","v":0},0]
[null,null,null,null,null,null,null,null,null,null,133,{"$f":"IF(ISNA(VLOOKUP($K147&L$14,Input!AT138:AT232,1,FALSE)),\"\",VLOOKUP($K147&L$14,Input!AT138:AW232,4,FALSE))","v":""},{"$f":"IF(ISNA(VLOOKUP($K147&M$14,Input!AT138:AT232,1,FALSE)),0,VLOOKUP($K147&M$14,Input!AT138:AU232,2,FALSE))","v":0},{"$f":"IF(ISNA(VLOOKUP($K147&N$14,Input!AT138:AT232,1,FALSE)),0,VLOOKUP($K147&N$14,Input!AT138:AU232,2,FALSE))","v":0},{"$f":"IF(ISNA(VLOOKUP($K147&O$14,Input!AT138:AT232,1,FALSE)),0,1)","v":0},0]
[null,null,null,null,null,null,null,null,null,null,134,{"$f":"IF(ISNA(VLOOKUP($K148&L$14,Input!AT139:AT233,1,FALSE)),\"\",VLOOKUP($K148&L$14,Input!AT139:AW233,4,FALSE))","v":""},{"$f":"IF(ISNA(VLOOKUP($K148&M$14,Input!AT139:AT233,1,FALSE)),0,VLOOKUP($K148&M$14,Input!AT139:AU233,2,FALSE))","v":0},{"$f":"IF(ISNA(VLOOKUP($K148&N$14,Input!AT139:AT233,1,FALSE)),0,VLOOKUP($K148&N$14,Input!AT139:AU233,2,FALSE))","v":0},{"$f":"IF(ISNA(VLOOKUP($K148&O$14,Input!AT139:AT233,1,FALSE)),0,1)","v":0},0]
[null,null,null,null,null,null,null,null,null,null,135,{"$f":"IF(ISNA(VLOOKUP($K149&L$14,Input!AT140:AT234,1,FALSE)),\"\",VLOOKUP($K149&L$14,Input!AT140:AW234,4,FALSE))","v":""},{"$f":"IF(ISNA(VLOOKUP($K149&M$14,Input!AT140:AT234,1,FALSE)),0,VLOOKUP($K149&M$14,Input!AT140:AU234,2,FALSE))","v":0},{"$f":"IF(ISNA(VLOOKUP($K149&N$14,Input!AT140:AT234,1,FALSE)),0,VLOOKUP($K149&N$14,Input!AT140:AU234,2,FALSE))","v":0},{"$f":"IF(ISNA(VLOOKUP($K149&O$14,Input!AT140:AT234,1,FALSE)),0,1)","v":0},0]
[null,null,null,null,null,null,null,null,null,null,136,{"$f":"IF(ISNA(VLOOKUP($K150&L$14,Input!AT141:AT235,1,FALSE)),\"\",VLOOKUP($K150&L$14,Input!AT141:AW235,4,FALSE))","v":""},{"$f":"IF(ISNA(VLOOKUP($K150&M$14,Input!AT141:AT235,1,FALSE)),0,VLOOKUP($K150&M$14,Input!AT141:AU235,2,FALSE))","v":0},{"$f":"IF(ISNA(VLOOKUP($K150&N$14,Input!AT141:AT235,1,FALSE)),0,VLOOKUP($K150&N$14,Input!AT141:AU235,2,FALSE))","v":0},{"$f":"IF(ISNA(VLOOKUP($K150&O$14,Input!AT141:AT235,1,FALSE)),0,1)","v":0},0]
[null,null,null,null,null,null,null,null,null,null,137,{"$f":"IF(ISNA(VLOOKUP($K151&L$14,Input!AT142:AT236,1,FALSE)),\"\",VLOOKUP($K151&L$14,Input!AT142:AW236,4,FALSE))","v":""},{"$f":"IF(ISNA(VLOOKUP($K151&M$14,Input!AT142:AT236,1,FALSE)),0,VLOOKUP($K151&M$14,Input!AT142:AU236,2,FALSE))","v":0},{"$f":"IF(ISNA(VLOOKUP($K151&N$14,Input!AT142:AT236,1,FALSE)),0,VLOOKUP($K151&N$14,Input!AT142:AU236,2,FALSE))","v":0},{"$f":"IF(ISNA(VLOOKUP($K151&O$14,Input!AT142:AT236,1,FALSE)),0,1)","v":0},0]
[null,null,null,null,null,null,null,null,null,null,138,{"$f":"IF(ISNA(VLOOKUP($K152&L$14,Input!AT143:AT237,1,FALSE)),\"\",VLOOKUP($K152&L$14,Input!AT143:AW237,4,FALSE))","v":""},{"$f":"IF(ISNA(VLOOKUP($K152&M$14,Input!AT143:AT237,1,FALSE)),0,VLOOKUP($K152&M$14,Input!AT143:AU237,2,FALSE))","v":0},{"$f":"IF(ISNA(VLOOKUP($K152&N$14,Input!AT143:AT237,1,FALSE)),0,VLOOKUP($K152&N$14,Input!AT143:AU237,2,FALSE))","v":0},{"$f":"IF(ISNA(VLOOKUP($K152&O$14,Input!AT143:AT237,1,FALSE)),0,1)","v":0},0]
[null,null,null,null,null,null,null,null,null,null,139,{"$f":"IF(ISNA(VLOOKUP($K153&L$14,Input!AT144:AT238,1,FALSE)),\"\",VLOOKUP($K153&L$14,Input!AT144:AW238,4,FALSE))","v":""},{"$f":"IF(ISNA(VLOOKUP($K153&M$14,Input!AT144:AT238,1,FALSE)),0,VLOOKUP($K153&M$14,Input!AT144:AU238,2,FALSE))","v":0},{"$f":"IF(ISNA(VLOOKUP($K153&N$14,Input!AT144:AT238,1,FALSE)),0,VLOOKUP($K153&N$14,Input!AT144:AU238,2,FALSE))","v":0},{"$f":"IF(ISNA(VLOOKUP($K153&O$14,Input!AT144:AT238,1,FALSE)),0,1)","v":0},0]
[null,null,null,null,null,null,null,null,null,null,140,{"$f":"IF(ISNA(VLOOKUP($K154&L$14,Input!AT145:AT239,1,FALSE)),\"\",VLOOKUP($K154&L$14,Input!AT145:AW239,4,FALSE))","v":""},{"$f":"IF(ISNA(VLOOKUP($K154&M$14,Input!AT145:AT239,1,FALSE)),0,VLOOKUP($K154&M$14,Input!AT145:AU239,2,FALSE))","v":0},{"$f":"IF(ISNA(VLOOKUP($K154&N$14,Input!AT145:AT239,1,FALSE)),0,VLOOKUP($K154&N$14,Input!AT145:AU239,2,FALSE))","v":0},{"$f":"IF(ISNA(VLOOKUP($K154&O$14,Input!AT145:AT239,1,FALSE)),0,1)","v":0},0]
[null,null,null,null,null,null,null,null,null,null,141,{"$f":"IF(ISNA(VLOOKUP($K155&L$14,Input!AT146:AT240,1,FALSE)),\"\",VLOOKUP($K155&L$14,Input!AT146:AW240,4,FALSE))","v":""},{"$f":"IF(ISNA(VLOOKUP($K155&M$14,Input!AT146:AT240,1,FALSE)),0,VLOOKUP($K155&M$14,Input!AT146:AU240,2,FALSE))","v":0},{"$f":"IF(ISNA(VLOOKUP($K155&N$14,Input!AT146:AT240,1,FALSE)),0,VLOOKUP($K155&N$14,Input!AT146:AU240,2,FALSE))","v":0},{"$f":"IF(ISNA(VLOOKUP($K155&O$14,Input!AT146:AT240,1,FALSE)),0,1)","v":0},0]
[null,null,null,null,null,null,null,null,null,null,142,{"$f":"IF(ISNA(VLOOKUP($K156&L$14,Input!AT147:AT241,1,FALSE)),\"\",VLOOKUP($K156&L$14,Input!AT147:AW241,4,FALSE))","v":""},{"$f":"IF(ISNA(VLOOKUP($K156&M$14,Input!AT147:AT241,1,FALSE)),0,VLOOKUP($K156&M$14,Input!AT147:AU241,2,FALSE))","v":0},{"$f":"IF(ISNA(VLOOKUP($K156&N$14,Input!AT147:AT241,1,FALSE)),0,VLOOKUP($K156&N$14,Input!AT147:AU241,2,FALSE))","v":0},{"$f":"IF(ISNA(VLOOKUP($K156&O$14,Input!AT147:AT241,1,FALSE)),0,1)","v":0},0]
[null,null,null,null,null,null,null,null,null,null,143,{"$f":"IF(ISNA(VLOOKUP($K157&L$14,Input!AT148:AT242,1,FALSE)),\"\",VLOOKUP($K157&L$14,Input!AT148:AW242,4,FALSE))","v":""},{"$f":"IF(ISNA(VLOOKUP($K157&M$14,Input!AT148:AT242,1,FALSE)),0,VLOOKUP($K157&M$14,Input!AT148:AU242,2,FALSE))","v":0},{"$f":"IF(ISNA(VLOOKUP($K157&N$14,Input!AT148:AT242,1,FALSE)),0,VLOOKUP($K157&N$14,Input!AT148:AU242,2,FALSE))","v":0},{"$f":"IF(ISNA(VLOOKUP($K157&O$14,Input!AT148:AT242,1,FALSE)),0,1)","v":0},0]
[null,null,null,null,null,null,null,null,null,null,144,{"$f":"IF(ISNA(VLOOKUP($K158&L$14,Input!AT149:AT243,1,FALSE)),\"\",VLOOKUP($K158&L$14,Input!AT149:AW243,4,FALSE))","v":""},{"$f":"IF(ISNA(VLOOKUP($K158&M$14,Input!AT149:AT243,1,FALSE)),0,VLOOKUP($K158&M$14,Input!AT149:AU243,2,FALSE))","v":0},{"$f":"IF(ISNA(VLOOKUP($K158&N$14,Input!AT149:AT243,1,FALSE)),0,VLOOKUP($K158&N$14,Input!AT149:AU243,2,FALSE))","v":0},{"$f":"IF(ISNA(VLOOKUP($K158&O$14,Input!AT149:AT243,1,FALSE)),0,1)","v":0},0]
[null,null,null,null,null,null,null,null,null,null,145,{"$f":"IF(ISNA(VLOOKUP($K159&L$14,Input!AT150:AT244,1,FALSE)),\"\",VLOOKUP($K159&L$14,Input!AT150:AW244,4,FALSE))","v":""},{"$f":"IF(ISNA(VLOOKUP($K159&M$14,Input!AT150:AT244,1,FALSE)),0,VLOOKUP($K159&M$14,Input!AT150:AU244,2,FALSE))","v":0},{"$f":"IF(ISNA(VLOOKUP($K159&N$14,Input!AT150:AT244,1,FALSE)),0,VLOOKUP($K159&N$14,Input!AT150:AU244,2,FALSE))","v":0},{"$f":"IF(ISNA(VLOOKUP($K159&O$14,Input!AT150:AT244,1,FALSE)),0,1)","v":0},0]
[null,null,null,null,null,null,null,null,null,null,146,{"$f":"IF(ISNA(VLOOKUP($K160&L$14,Input!AT151:AT245,1,FALSE)),\"\",VLOOKUP($K160&L$14,Input!AT151:AW245,4,FALSE))","v":""},{"$f":"IF(ISNA(VLOOKUP($K160&M$14,Input!AT151:AT245,1,FALSE)),0,VLOOKUP($K160&M$14,Input!AT151:AU245,2,FALSE))","v":0},{"$f":"IF(ISNA(VLOOKUP($K160&N$14,Input!AT151:AT245,1,FALSE)),0,VLOOKUP($K160&N$14,Input!AT151:AU245,2,FALSE))","v":0},{"$f":"IF(ISNA(VLOOKUP($K160&O$14,Input!AT151:AT245,1,FALSE)),0,1)","v":0},0]
[null,null,null,null,null,null,null,null,null,null,147,{"$f":"IF(ISNA(VLOOKUP($K161&L$14,Input!AT152:AT246,1,FALSE)),\"\",VLOOKUP($K161&L$14,Input!AT152:AW246,4,FALSE))","v":""},{"$f":"IF(ISNA(VLOOKUP($K161&M$14,Input!AT152:AT246,1,FALSE)),0,VLOOKUP($K161&M$14,Input!AT152:AU246,2,FALSE))","v":0},{"$f":"IF(ISNA(VLOOKUP($K161&N$14,Input!AT152:AT246,1,FALSE)),0,VLOOKUP($K161&N$14,Input!AT152:AU246,2,FALSE))","v":0},{"$f":"IF(ISNA(VLOOKUP($K161&O$14,Input!AT152:AT246,1,FALSE)),0,1)","v":0},0]
[null,null,null,null,null,null,null,null,null,null,148,{"$f":"IF(ISNA(VLOOKUP($K162&L$14,Input!AT153:AT247,1,FALSE)),\"\",VLOOKUP($K162&L$14,Input!AT153:AW247,4,FALSE))","v":""},{"$f":"IF(ISNA(VLOOKUP($K162&M$14,Input!AT153:AT247,1,FALSE)),0,VLOOKUP($K162&M$14,Input!AT153:AU247,2,FALSE))","v":0},{"$f":"IF(ISNA(VLOOKUP($K162&N$14,Input!AT153:AT247,1,FALSE)),0,VLOOKUP($K162&N$14,Input!AT153:AU247,2,FALSE))","v":0},{"$f":"IF(ISNA(VLOOKUP($K162&O$14,Input!AT153:AT247,1,FALSE)),0,1)","v":0},0]
[null,null,null,null,null,null,null,null,null,null,149,{"$f":"IF(ISNA(VLOOKUP($K163&L$14,Input!AT154:AT248,1,FALSE)),\"\",VLOOKUP($K163&L$14,Input!AT154:AW248,4,FALSE))","v":""},{"$f":"IF(ISNA(VLOOKUP($K163&M$14,Input!AT154:AT248,1,FALSE)),0,VLOOKUP($K163&M$14,Input!AT154:AU248,2,FALSE))","v":0},{"$f":"IF(ISNA(VLOOKUP($K163&N$14,Input!AT154:AT248,1,FALSE)),0,VLOOKUP($K163&N$14,Input!AT154:AU248,2,FALSE))","v":0},{"$f":"IF(ISNA(VLOOKUP($K163&O$14,Input!AT154:AT248,1,FALSE)),0,1)","v":0},0]
[null,null,null,null,null,null,null,null,null,null,150,{"$f":"IF(ISNA(VLOOKUP($K164&L$14,Input!AT155:AT249,1,FALSE)),\"\",VLOOKUP($K164&L$14,Input!AT155:AW249,4,FALSE))","v":""},{"$f":"IF(ISNA(VLOOKUP($K164&M$14,Input!AT155:AT249,1,FALSE)),0,VLOOKUP($K164&M$14,Input!AT155:AU249,2,FALSE))","v":0},{"$f":"IF(ISNA(VLOOKUP($K164&N$14,Input!AT155:AT249,1,FALSE)),0,VLOOKUP($K164&N$14,Input!AT155:AU249,2,FALSE))","v":0},{"$f":"IF(ISNA(VLOOKUP($K164&O$14,Input!AT155:AT249,1,FALSE)),0,1)","v":0},0]
[null,null,null,null,null,null,null,null,null,null,151,{"$f":"IF(ISNA(VLOOKUP($K165&L$14,Input!AT156:AT250,1,FALSE)),\"\",VLOOKUP($K165&L$14,Input!AT156:AW250,4,FALSE))","v":""},{"$f":"IF(ISNA(VLOOKUP($K165&M$14,Input!AT156:AT250,1,FALSE)),0,VLOOKUP($K165&M$14,Input!AT156:AU250,2,FALSE))","v":0},{"$f":"IF(ISNA(VLOOKUP($K165&N$14,Input!AT156:AT250,1,FALSE)),0,VLOOKUP($K165&N$14,Input!AT156:AU250,2,FALSE))","v":0},{"$f":"IF(ISNA(VLOOKUP($K165&O$14,Input!AT156:AT250,1,FALSE)),0,1)","v":0},0]
[null,null,null,null,null,null,null,null,null,null,152,{"$f":"IF(ISNA(VLOOKUP($K166&L$14,Input!AT157:AT251,1,FALSE)),\"\",VLOOKUP($K166&L$14,Input!AT157:AW251,4,FALSE))","v":""},{"$f":"IF(ISNA(VLOOKUP($K166&M$14,Input!AT157:AT251,1,FALSE)),0,VLOOKUP($K166&M$14,Input!AT157:AU251,2,FALSE))","v":0},{"$f":"IF(ISNA(VLOOKUP($K166&N$14,Input!AT157:AT251,1,FALSE)),0,VLOOKUP($K166&N$14,Input!AT157:AU251,2,FALSE))","v":0},{"$f":"IF(ISNA(VLOOKUP($K166&O$14,Input!AT157:AT251,1,FALSE)),0,1)","v":0},0]
[null,null,null,null,null,null,null,null,null,null,153,{"$f":"IF(ISNA(VLOOKUP($K167&L$14,Input!AT158:AT252,1,FALSE)),\"\",VLOOKUP($K167&L$14,Input!AT158:AW252,4,FALSE))","v":""},{"$f":"IF(ISNA(VLOOKUP($K167&M$14,Input!AT158:AT252,1,FALSE)),0,VLOOKUP($K167&M$14,Input!AT158:AU252,2,FALSE))","v":0},{"$f":"IF(ISNA(VLOOKUP($K167&N$14,Input!AT158:AT252,1,FALSE)),0,VLOOKUP($K167&N$14,Input!AT158:AU252,2,FALSE))","v":0},{"$f":"IF(ISNA(VLOOKUP($K167&O$14,Input!AT158:AT252,1,FALSE)),0,1)","v":0},0]
[null,null,null,null,null,null,null,null,null,null,154,{"$f":"IF(ISNA(VLOOKUP($K168&L$14,Input!AT159:AT253,1,FALSE)),\"\",VLOOKUP($K168&L$14,Input!AT159:AW253,4,FALSE))","v":""},{"$f":"IF(ISNA(VLOOKUP($K168&M$14,Input!AT159:AT253,1,FALSE)),0,VLOOKUP($K168&M$14,Input!AT159:AU253,2,FALSE))","v":0},{"$f":"IF(ISNA(VLOOKUP($K168&N$14,Input!AT159:AT253,1,FALSE)),0,VLOOKUP($K168&N$14,Input!AT159:AU253,2,FALSE))","v":0},{"$f":"IF(ISNA(VLOOKUP($K168&O$14,Input!AT159:AT253,1,FALSE)),0,1)","v":0},0]
[null,null,null,null,null,null,null,null,null,null,155,{"$f":"IF(ISNA(VLOOKUP($K169&L$14,Input!AT160:AT254,1,FALSE)),\"\",VLOOKUP($K169&L$14,Input!AT160:AW254,4,FALSE))","v":""},{"$f":"IF(ISNA(VLOOKUP($K169&M$14,Input!AT160:AT254,1,FALSE)),0,VLOOKUP($K169&M$14,Input!AT160:AU254,2,FALSE))","v":0},{"$f":"IF(ISNA(VLOOKUP($K169&N$14,Input!AT160:AT254,1,FALSE)),0,VLOOKUP($K169&N$14,Input!AT160:AU254,2,FALSE))","v":0},{"$f":"IF(ISNA(VLOOKUP($K169&O$14,Input!AT160:AT254,1,FALSE)),0,1)","v":0},0]
[null,null,null,null,null,null,null,null,null,null,156,{"$f":"IF(ISNA(VLOOKUP($K170&L$14,Input!AT161:AT255,1,FALSE)),\"\",VLOOKUP($K170&L$14,Input!AT161:AW255,4,FALSE))","v":""},{"$f":"IF(ISNA(VLOOKUP($K170&M$14,Input!AT161:AT255,1,FALSE)),0,VLOOKUP($K170&M$14,Input!AT161:AU255,2,FALSE))","v":0},{"$f":"IF(ISNA(VLOOKUP($K170&N$14,Input!AT161:AT255,1,FALSE)),0,VLOOKUP($K170&N$14,Input!AT161:AU255,2,FALSE))","v":0},{"$f":"IF(ISNA(VLOOKUP($K170&O$14,Input!AT161:AT255,1,FALSE)),0,1)","v":0},0]
[null,null,null,null,null,null,null,null,null,null,157,{"$f":"IF(ISNA(VLOOKUP($K171&L$14,Input!AT162:AT256,1,FALSE)),\"\",VLOOKUP($K171&L$14,Input!AT162:AW256,4,FALSE))","v":""},{"$f":"IF(ISNA(VLOOKUP($K171&M$14,Input!AT162:AT256,1,FALSE)),0,VLOOKUP($K171&M$14,Input!AT162:AU256,2,FALSE))","v":0},{"$f":"IF(ISNA(VLOOKUP($K171&N$14,Input!AT162:AT256,1,FALSE)),0,VLOOKUP($K171&N$14,Input!AT162:AU256,2,FALSE))","v":0},{"$f":"IF(ISNA(VLOOKUP($K171&O$14,Input!AT162:AT256,1,FALSE)),0,1)","v":0},0]
[null,null,null,null,null,null,null,null,null,null,158,{"$f":"IF(ISNA(VLOOKUP($K172&L$14,Input!AT163:AT257,1,FALSE)),\"\",VLOOKUP($K172&L$14,Input!AT163:AW257,4,FALSE))","v":""},{"$f":"IF(ISNA(VLOOKUP($K172&M$14,Input!AT163:AT257,1,FALSE)),0,VLOOKUP($K172&M$14,Input!AT163:AU257,2,FALSE))","v":0},{"$f":"IF(ISNA(VLOOKUP($K172&N$14,Input!AT163:AT257,1,FALSE)),0,VLOOKUP($K172&N$14,Input!AT163:AU257,2,FALSE))","v":0},{"$f":"IF(ISNA(VLOOKUP($K172&O$14,Input!AT163:AT257,1,FALSE)),0,1)","v":0},0]
[null,null,null,null,null,null,null,null,null,null,159,{"$f":"IF(ISNA(VLOOKUP($K173&L$14,Input!AT164:AT258,1,FALSE)),\"\",VLOOKUP($K173&L$14,Input!AT164:AW258,4,FALSE))","v":""},{"$f":"IF(ISNA(VLOOKUP($K173&M$14,Input!AT164:AT258,1,FALSE)),0,VLOOKUP($K173&M$14,Input!AT164:AU258,2,FALSE))","v":0},{"$f":"IF(ISNA(VLOOKUP($K173&N$14,Input!AT164:AT258,1,FALSE)),0,VLOOKUP($K173&N$14,Input!AT164:AU258,2,FALSE))","v":0},{"$f":"IF(ISNA(VLOOKUP($K173&O$14,Input!AT164:AT258,1,FALSE)),0,1)","v":0},0]
[null,null,null,null,null,null,null,null,null,null,160,{"$f":"IF(ISNA(VLOOKUP($K174&L$14,Input!AT165:AT259,1,FALSE)),\"\",VLOOKUP($K174&L$14,Input!AT165:AW259,4,FALSE))","v":""},{"$f":"IF(ISNA(VLOOKUP($K174&M$14,Input!AT165:AT259,1,FALSE)),0,VLOOKUP($K174&M$14,Input!AT165:AU259,2,FALSE))","v":0},{"$f":"IF(ISNA(VLOOKUP($K174&N$14,Input!AT165:AT259,1,FALSE)),0,VLOOKUP($K174&N$14,Input!AT165:AU259,2,FALSE))","v":0},{"$f":"IF(ISNA(VLOOKUP($K174&O$14,Input!AT165:AT259,1,FALSE)),0,1)","v":0},0]
[null,null,null,null,null,null,null,null,null,null,161,{"$f":"IF(ISNA(VLOOKUP($K175&L$14,Input!AT166:AT260,1,FALSE)),\"\",VLOOKUP($K175&L$14,Input!AT166:AW260,4,FALSE))","v":""},{"$f":"IF(ISNA(VLOOKUP($K175&M$14,Input!AT166:AT260,1,FALSE)),0,VLOOKUP($K175&M$14,Input!AT166:AU260,2,FALSE))","v":0},{"$f":"IF(ISNA(VLOOKUP($K175&N$14,Input!AT166:AT260,1,FALSE)),0,VLOOKUP($K175&N$14,Input!AT166:AU260,2,FALSE))","v":0},{"$f":"IF(ISNA(VLOOKUP($K175&O$14,Input!AT166:AT260,1,FALSE)),0,1)","v":0},0]
[null,null,null,null,null,null,null,null,null,null,162,{"$f":"IF(ISNA(VLOOKUP($K176&L$14,Input!AT167:AT261,1,FALSE)),\"\",VLOOKUP($K176&L$14,Input!AT167:AW261,4,FALSE))","v":""},{"$f":"IF(ISNA(VLOOKUP($K176&M$14,Input!AT167:AT261,1,FALSE)),0,VLOOKUP($K176&M$14,Input!AT167:AU261,2,FALSE))","v":0},{"$f":"IF(ISNA(VLOOKUP($K176&N$14,Input!AT167:AT261,1,FALSE)),0,VLOOKUP($K176&N$14,Input!AT167:AU261,2,FALSE))","v":0},{"$f":"IF(ISNA(VLOOKUP($K176&O$14,Input!AT167:AT261,1,FALSE)),0,1)","v":0},0]
[null,null,null,null,null,null,null,null,null,null,163,{"$f":"IF(ISNA(VLOOKUP($K177&L$14,Input!AT168:AT262,1,FALSE)),\"\",VLOOKUP($K177&L$14,Input!AT168:AW262,4,FALSE))","v":""},{"$f":"IF(ISNA(VLOOKUP($K177&M$14,Input!AT168:AT262,1,FALSE)),0,VLOOKUP($K177&M$14,Input!AT168:AU262,2,FALSE))","v":0},{"$f":"IF(ISNA(VLOOKUP($K177&N$14,Input!AT168:AT262,1,FALSE)),0,VLOOKUP($K177&N$14,Input!AT168:AU262,2,FALSE))","v":0},{"$f":"IF(ISNA(VLOOKUP($K177&O$14,Input!AT168:AT262,1,FALSE)),0,1)","v":0},0]
[null,null,null,null,null,null,null,null,null,null,164,{"$f":"IF(ISNA(VLOOKUP($K178&L$14,Input!AT169:AT263,1,FALSE)),\"\",VLOOKUP($K178&L$14,Input!AT169:AW263,4,FALSE))","v":""},{"$f":"IF(ISNA(VLOOKUP($K178&M$14,Input!AT169:AT263,1,FALSE)),0,VLOOKUP($K178&M$14,Input!AT169:AU263,2,FALSE))","v":0},{"$f":"IF(ISNA(VLOOKUP($K178&N$14,Input!AT169:AT263,1,FALSE)),0,VLOOKUP($K178&N$14,Input!AT169:AU263,2,FALSE))","v":0},{"$f":"IF(ISNA(VLOOKUP($K178&O$14,Input!AT169:AT263,1,FALSE)),0,1)","v":0},0]
[null,null,null,null,null,null,null,null,null,null,165,{"$f":"IF(ISNA(VLOOKUP($K179&L$14,Input!AT170:AT264,1,FALSE)),\"\",VLOOKUP($K179&L$14,Input!AT170:AW264,4,FALSE))","v":""},{"$f":"IF(ISNA(VLOOKUP($K179&M$14,Input!AT170:AT264,1,FALSE)),0,VLOOKUP($K179&M$14,Input!AT170:AU264,2,FALSE))","v":0},{"$f":"IF(ISNA(VLOOKUP($K179&N$14,Input!AT170:AT264,1,FALSE)),0,VLOOKUP($K179&N$14,Input!AT170:AU264,2,FALSE))","v":0},{"$f":"IF(ISNA(VLOOKUP($K179&O$14,Input!AT170:AT264,1,FALSE)),0,1)","v":0},0]
[null,null,null,null,null,null,null,null,null,null,166,{"$f":"IF(ISNA(VLOOKUP($K180&L$14,Input!AT171:AT265,1,FALSE)),\"\",VLOOKUP($K180&L$14,Input!AT171:AW265,4,FALSE))","v":""},{"$f":"IF(ISNA(VLOOKUP($K180&M$14,Input!AT171:AT265,1,FALSE)),0,VLOOKUP($K180&M$14,Input!AT171:AU265,2,FALSE))","v":0},{"$f":"IF(ISNA(VLOOKUP($K180&N$14,Input!AT171:AT265,1,FALSE)),0,VLOOKUP($K180&N$14,Input!AT171:AU265,2,FALSE))","v":0},{"$f":"IF(ISNA(VLOOKUP($K180&O$14,Input!AT171:AT265,1,FALSE)),0,1)","v":0},0]
[null,null,null,null,null,null,null,null,null,null,167,{"$f":"IF(ISNA(VLOOKUP($K181&L$14,Input!AT172:AT266,1,FALSE)),\"\",VLOOKUP($K181&L$14,Input!AT172:AW266,4,FALSE))","v":""},{"$f":"IF(ISNA(VLOOKUP($K181&M$14,Input!AT172:AT266,1,FALSE)),0,VLOOKUP($K181&M$14,Input!AT172:AU266,2,FALSE))","v":0},{"$f":"IF(ISNA(VLOOKUP($K181&N$14,Input!AT172:AT266,1,FALSE)),0,VLOOKUP($K181&N$14,Input!AT172:AU266,2,FALSE))","v":0},{"$f":"IF(ISNA(VLOOKUP($K181&O$14,Input!AT172:AT266,1,FALSE)),0,1)","v":0},0]
[null,null,null,null,null,null,null,null,null,null,168,{"$f":"IF(ISNA(VLOOKUP($K182&L$14,Input!AT173:AT267,1,FALSE)),\"\",VLOOKUP($K182&L$14,Input!AT173:AW267,4,FALSE))","v":""},{"$f":"IF(ISNA(VLOOKUP($K182&M$14,Input!AT173:AT267,1,FALSE)),0,VLOOKUP($K182&M$14,Input!AT173:AU267,2,FALSE))","v":0},{"$f":"IF(ISNA(VLOOKUP($K182&N$14,Input!AT173:AT267,1,FALSE)),0,VLOOKUP($K182&N$14,Input!AT173:AU267,2,FALSE))","v":0},{"$f":"IF(ISNA(VLOOKUP($K182&O$14,Input!AT173:AT267,1,FALSE)),0,1)","v":0},0]
[null,null,null,null,null,null,null,null,null,null,169,{"$f":"IF(ISNA(VLOOKUP($K183&L$14,Input!AT174:AT268,1,FALSE)),\"\",VLOOKUP($K183&L$14,Input!AT174:AW268,4,FALSE))","v":""},{"$f":"IF(ISNA(VLOOKUP($K183&M$14,Input!AT174:AT268,1,FALSE)),0,VLOOKUP($K183&M$14,Input!AT174:AU268,2,FALSE))","v":0},{"$f":"IF(ISNA(VLOOKUP($K183&N$14,Input!AT174:AT268,1,FALSE)),0,VLOOKUP($K183&N$14,Input!AT174:AU268,2,FALSE))","v":0},{"$f":"IF(ISNA(VLOOKUP($K183&O$14,Input!AT174:AT268,1,FALSE)),0,1)","v":0},0]
[null,null,null,null,null,null,null,null,null,null,170,{"$f":"IF(ISNA(VLOOKUP($K184&L$14,Input!AT175:AT269,1,FALSE)),\"\",VLOOKUP($K184&L$14,Input!AT175:AW269,4,FALSE))","v":""},{"$f":"IF(ISNA(VLOOKUP($K184&M$14,Input!AT175:AT269,1,FALSE)),0,VLOOKUP($K184&M$14,Input!AT175:AU269,2,FALSE))","v":0},{"$f":"IF(ISNA(VLOOKUP($K184&N$14,Input!AT175:AT269,1,FALSE)),0,VLOOKUP($K184&N$14,Input!AT175:AU269,2,FALSE))","v":0},{"$f":"IF(ISNA(VLOOKUP($K184&O$14,Input!AT175:AT269,1,FALSE)),0,1)","v":0},0]
[null,null,null,null,null,null,null,null,null,null,171,{"$f":"IF(ISNA(VLOOKUP($K185&L$14,Input!AT176:AT270,1,FALSE)),\"\",VLOOKUP($K185&L$14,Input!AT176:AW270,4,FALSE))","v":""},{"$f":"IF(ISNA(VLOOKUP($K185&M$14,Input!AT176:AT270,1,FALSE)),0,VLOOKUP($K185&M$14,Input!AT176:AU270,2,FALSE))","v":0},{"$f":"IF(ISNA(VLOOKUP($K185&N$14,Input!AT176:AT270,1,FALSE)),0,VLOOKUP($K185&N$14,Input!AT176:AU270,2,FALSE))","v":0},{"$f":"IF(ISNA(VLOOKUP($K185&O$14,Input!AT176:AT270,1,FALSE)),0,1)","v":0},0]
[null,null,null,null,null,null,null,null,null,null,172,{"$f":"IF(ISNA(VLOOKUP($K186&L$14,Input!AT177:AT271,1,FALSE)),\"\",VLOOKUP($K186&L$14,Input!AT177:AW271,4,FALSE))","v":""},{"$f":"IF(ISNA(VLOOKUP($K186&M$14,Input!AT177:AT271,1,FALSE)),0,VLOOKUP($K186&M$14,Input!AT177:AU271,2,FALSE))","v":0},{"$f":"IF(ISNA(VLOOKUP($K186&N$14,Input!AT177:AT271,1,FALSE)),0,VLOOKUP($K186&N$14,Input!AT177:AU271,2,FALSE))","v":0},{"$f":"IF(ISNA(VLOOKUP($K186&O$14,Input!AT177:AT271,1,FALSE)),0,1)","v":0},0]
[null,null,null,null,null,null,null,null,null,null,173,{"$f":"IF(ISNA(VLOOKUP($K187&L$14,Input!AT178:AT272,1,FALSE)),\"\",VLOOKUP($K187&L$14,Input!AT178:AW272,4,FALSE))","v":""},{"$f":"IF(ISNA(VLOOKUP($K187&M$14,Input!AT178:AT272,1,FALSE)),0,VLOOKUP($K187&M$14,Input!AT178:AU272,2,FALSE))","v":0},{"$f":"IF(ISNA(VLOOKUP($K187&N$14,Input!AT178:AT272,1,FALSE)),0,VLOOKUP($K187&N$14,Input!AT178:AU272,2,FALSE))","v":0},{"$f":"IF(ISNA(VLOOKUP($K187&O$14,Input!AT178:AT272,1,FALSE)),0,1)","v":0},0]
[null,null,null,null,null,null,null,null,null,null,174,{"$f":"IF(ISNA(VLOOKUP($K188&L$14,Input!AT179:AT273,1,FALSE)),\"\",VLOOKUP($K188&L$14,Input!AT179:AW273,4,FALSE))","v":""},{"$f":"IF(ISNA(VLOOKUP($K188&M$14,Input!AT179:AT273,1,FALSE)),0,VLOOKUP($K188&M$14,Input!AT179:AU273,2,FALSE))","v":0},{"$f":"IF(ISNA(VLOOKUP($K188&N$14,Input!AT179:AT273,1,FALSE)),0,VLOOKUP($K188&N$14,Input!AT179:AU273,2,FALSE))","v":0},{"$f":"IF(ISNA(VLOOKUP($K188&O$14,Input!AT179:AT273,1,FALSE)),0,1)","v":0},0]
[null,null,null,null,null,null,null,null,null,null,175,{"$f":"IF(ISNA(VLOOKUP($K189&L$14,Input!AT180:AT274,1,FALSE)),\"\",VLOOKUP($K189&L$14,Input!AT180:AW274,4,FALSE))","v":""},{"$f":"IF(ISNA(VLOOKUP($K189&M$14,Input!AT180:AT274,1,FALSE)),0,VLOOKUP($K189&M$14,Input!AT180:AU274,2,FALSE))","v":0},{"$f":"IF(ISNA(VLOOKUP($K189&N$14,Input!AT180:AT274,1,FALSE)),0,VLOOKUP($K189&N$14,Input!AT180:AU274,2,FALSE))","v":0},{"$f":"IF(ISNA(VLOOKUP($K189&O$14,Input!AT180:AT274,1,FALSE)),0,1)","v":0},0]
[null,null,null,null,null,null,null,null,null,null,176,{"$f":"IF(ISNA(VLOOKUP($K190&L$14,Input!AT181:AT275,1,FALSE)),\"\",VLOOKUP($K190&L$14,Input!AT181:AW275,4,FALSE))","v":""},{"$f":"IF(ISNA(VLOOKUP($K190&M$14,Input!AT181:AT275,1,FALSE)),0,VLOOKUP($K190&M$14,Input!AT181:AU275,2,FALSE))","v":0},{"$f":"IF(ISNA(VLOOKUP($K190&N$14,Input!AT181:AT275,1,FALSE)),0,VLOOKUP($K190&N$14,Input!AT181:AU275,2,FALSE))","v":0},{"$f":"IF(ISNA(VLOOKUP($K190&O$14,Input!AT181:AT275,1,FALSE)),0,1)","v":0},0]
[null,null,null,null,null,null,null,null,null,null,177,{"$f":"IF(ISNA(VLOOKUP($K191&L$14,Input!AT182:AT276,1,FALSE)),\"\",VLOOKUP($K191&L$14,Input!AT182:AW276,4,FALSE))","v":""},{"$f":"IF(ISNA(VLOOKUP($K191&M$14,Input!AT182:AT276,1,FALSE)),0,VLOOKUP($K191&M$14,Input!AT182:AU276,2,FALSE))","v":0},{"$f":"IF(ISNA(VLOOKUP($K191&N$14,Input!AT182:AT276,1,FALSE)),0,VLOOKUP($K191&N$14,Input!AT182:AU276,2,FALSE))","v":0},{"$f":"IF(ISNA(VLOOKUP($K191&O$14,Input!AT182:AT276,1,FALSE)),0,1)","v":0},0]
[null,null,null,null,null,null,null,null,null,null,178,{"$f":"IF(ISNA(VLOOKUP($K192&L$14,Input!AT183:AT277,1,FALSE)),\"\",VLOOKUP($K192&L$14,Input!AT183:AW277,4,FALSE))","v":""},{"$f":"IF(ISNA(VLOOKUP($K192&M$14,Input!AT183:AT277,1,FALSE)),0,VLOOKUP($K192&M$14,Input!AT183:AU277,2,FALSE))","v":0},{"$f":"IF(ISNA(VLOOKUP($K192&N$14,Input!AT183:AT277,1,FALSE)),0,VLOOKUP($K192&N$14,Input!AT183:AU277,2,FALSE))","v":0},{"$f":"IF(ISNA(VLOOKUP($K192&O$14,Input!AT183:AT277,1,FALSE)),0,1)","v":0},0]
[null,null,null,null,null,null,null,null,null,null,179,{"$f":"IF(ISNA(VLOOKUP($K193&L$14,Input!AT184:AT278,1,FALSE)),\"\",VLOOKUP($K193&L$14,Input!AT184:AW278,4,FALSE))","v":""},{"$f":"IF(ISNA(VLOOKUP($K193&M$14,Input!AT184:AT278,1,FALSE)),0,VLOOKUP($K193&M$14,Input!AT184:AU278,2,FALSE))","v":0},{"$f":"IF(ISNA(VLOOKUP($K193&N$14,Input!AT184:AT278,1,FALSE)),0,VLOOKUP($K193&N$14,Input!AT184:AU278,2,FALSE))","v":0},{"$f":"IF(ISNA(VLOOKUP($K193&O$14,Input!AT184:AT278,1,FALSE)),0,1)","v":0},{"$f":"IF(M193=0,0,1)+IF(N193=0,0,2)+IF(O193=0,0,4)","v":0}]
[null,null,null,null,null,null,null,null,null,null,180,{"$f":"IF(ISNA(VLOOKUP($K194&L$14,Input!AT185:AT279,1,FALSE)),\"\",VLOOKUP($K194&L$14,Input!AT185:AW279,4,FALSE))","v":""},{"$f":"IF(ISNA(VLOOKUP($K194&M$14,Input!AT185:AT279,1,FALSE)),0,VLOOKUP($K194&M$14,Input!AT185:AU279,2,FALSE))","v":0},{"$f":"IF(ISNA(VLOOKUP($K194&N$14,Input!AT185:AT279,1,FALSE)),0,VLOOKUP($K194&N$14,Input!AT185:AU279,2,FALSE))","v":0},{"$f":"IF(ISNA(VLOOKUP($K194&O$14,Input!AT185:AT279,1,FALSE)),0,1)","v":0},0]
[null,null,null,null,null,null,null,null,null,null,181,{"$f":"IF(ISNA(VLOOKUP($K195&L$14,Input!AT186:AT280,1,FALSE)),\"\",VLOOKUP($K195&L$14,Input!AT186:AW280,4,FALSE))","v":""},{"$f":"IF(ISNA(VLOOKUP($K195&M$14,Input!AT186:AT280,1,FALSE)),0,VLOOKUP($K195&M$14,Input!AT186:AU280,2,FALSE))","v":0},{"$f":"IF(ISNA(VLOOKUP($K195&N$14,Input!AT186:AT280,1,FALSE)),0,VLOOKUP($K195&N$14,Input!AT186:AU280,2,FALSE))","v":0},{"$f":"IF(ISNA(VLOOKUP($K195&O$14,Input!AT186:AT280,1,FALSE)),0,1)","v":0},0]
[null,null,null,null,null,null,null,null,null,null,182,{"$f":"IF(ISNA(VLOOKUP($K196&L$14,Input!AT187:AT281,1,FALSE)),\"\",VLOOKUP($K196&L$14,Input!AT187:AW281,4,FALSE))","v":""},{"$f":"IF(ISNA(VLOOKUP($K196&M$14,Input!AT187:AT281,1,FALSE)),0,VLOOKUP($K196&M$14,Input!AT187:AU281,2,FALSE))","v":0},{"$f":"IF(ISNA(VLOOKUP($K196&N$14,Input!AT187:AT281,1,FALSE)),0,VLOOKUP($K196&N$14,Input!AT187:AU281,2,FALSE))","v":0},{"$f":"IF(ISNA(VLOOKUP($K196&O$14,Input!AT187:AT281,1,FALSE)),0,1)","v":0},0]
[null,null,null,null,null,null,null,null,null,null,183,{"$f":"IF(ISNA(VLOOKUP($K197&L$14,Input!AT188:AT282,1,FALSE)),\"\",VLOOKUP($K197&L$14,Input!AT188:AW282,4,FALSE))","v":""},{"$f":"IF(ISNA(VLOOKUP($K197&M$14,Input!AT188:AT282,1,FALSE)),0,VLOOKUP($K197&M$14,Input!AT188:AU282,2,FALSE))","v":0},{"$f":"IF(ISNA(VLOOKUP($K197&N$14,Input!AT188:AT282,1,FALSE)),0,VLOOKUP($K197&N$14,Input!AT188:AU282,2,FALSE))","v":0},{"$f":"IF(ISNA(VLOOKUP($K197&O$14,Input!AT188:AT282,1,FALSE)),0,1)","v":0},0]
[null,null,null,null,null,null,null,null,null,null,184,{"$f":"IF(ISNA(VLOOKUP($K198&L$14,Input!AT189:AT283,1,FALSE)),\"\",VLOOKUP($K198&L$14,Input!AT189:AW283,4,FALSE))","v":""},{"$f":"IF(ISNA(VLOOKUP($K198&M$14,Input!AT189:AT283,1,FALSE)),0,VLOOKUP($K198&M$14,Input!AT189:AU283,2,FALSE))","v":0},{"$f":"IF(ISNA(VLOOKUP($K198&N$14,Input!AT189:AT283,1,FALSE)),0,VLOOKUP($K198&N$14,Input!AT189:AU283,2,FALSE))","v":0},{"$f":"IF(ISNA(VLOOKUP($K198&O$14,Input!AT189:AT283,1,FALSE)),0,1)","v":0},0]
[null,null,null,null,null,null,null,null,null,null,185,{"$f":"IF(ISNA(VLOOKUP($K199&L$14,Input!AT190:AT284,1,FALSE)),\"\",VLOOKUP($K199&L$14,Input!AT190:AW284,4,FALSE))","v":""},{"$f":"IF(ISNA(VLOOKUP($K199&M$14,Input!AT190:AT284,1,FALSE)),0,VLOOKUP($K199&M$14,Input!AT190:AU284,2,FALSE))","v":0},{"$f":"IF(ISNA(VLOOKUP($K199&N$14,Input!AT190:AT284,1,FALSE)),0,VLOOKUP($K199&N$14,Input!AT190:AU284,2,FALSE))","v":0},{"$f":"IF(ISNA(VLOOKUP($K199&O$14,Input!AT190:AT284,1,FALSE)),0,1)","v":0},0]
[null,null,null,null,null,null,null,null,null,null,186,{"$f":"IF(ISNA(VLOOKUP($K200&L$14,Input!AT191:AT285,1,FALSE)),\"\",VLOOKUP($K200&L$14,Input!AT191:AW285,4,FALSE))","v":""},{"$f":"IF(ISNA(VLOOKUP($K200&M$14,Input!AT191:AT285,1,FALSE)),0,VLOOKUP($K200&M$14,Input!AT191:AU285,2,FALSE))","v":0},{"$f":"IF(ISNA(VLOOKUP($K200&N$14,Input!AT191:AT285,1,FALSE)),0,VLOOKUP($K200&N$14,Input!AT191:AU285,2,FALSE))","v":0},{"$f":"IF(ISNA(VLOOKUP($K200&O$14,Input!AT191:AT285,1,FALSE)),0,1)","v":0},0]
[null,null,null,null,null,null,null,null,null,null,187,{"$f":"IF(ISNA(VLOOKUP($K201&L$14,Input!AT192:AT286,1,FALSE)),\"\",VLOOKUP($K201&L$14,Input!AT192:AW286,4,FALSE))","v":""},{"$f":"IF(ISNA(VLOOKUP($K201&M$14,Input!AT192:AT286,1,FALSE)),0,VLOOKUP($K201&M$14,Input!AT192:AU286,2,FALSE))","v":0},{"$f":"IF(ISNA(VLOOKUP($K201&N$14,Input!AT192:AT286,1,FALSE)),0,VLOOKUP($K201&N$14,Input!AT192:AU286,2,FALSE))","v":0},{"$f":"IF(ISNA(VLOOKUP($K201&O$14,Input!AT192:AT286,1,FALSE)),0,1)","v":0},0]
[null,null,null,null,null,null,null,null,null,null,188,{"$f":"IF(ISNA(VLOOKUP($K202&L$14,Input!AT193:AT287,1,FALSE)),\"\",VLOOKUP($K202&L$14,Input!AT193:AW287,4,FALSE))","v":""},{"$f":"IF(ISNA(VLOOKUP($K202&M$14,Input!AT193:AT287,1,FALSE)),0,VLOOKUP($K202&M$14,Input!AT193:AU287,2,FALSE))","v":0},{"$f":"IF(ISNA(VLOOKUP($K202&N$14,Input!AT193:AT287,1,FALSE)),0,VLOOKUP($K202&N$14,Input!AT193:AU287,2,FALSE))","v":0},{"$f":"IF(ISNA(VLOOKUP($K202&O$14,Input!AT193:AT287,1,FALSE)),0,1)","v":0},0]
[null,null,null,null,null,null,null,null,null,null,189,{"$f":"IF(ISNA(VLOOKUP($K203&L$14,Input!AT194:AT288,1,FALSE)),\"\",VLOOKUP($K203&L$14,Input!AT194:AW288,4,FALSE))","v":""},{"$f":"IF(ISNA(VLOOKUP($K203&M$14,Input!AT194:AT288,1,FALSE)),0,VLOOKUP($K203&M$14,Input!AT194:AU288,2,FALSE))","v":0},{"$f":"IF(ISNA(VLOOKUP($K203&N$14,Input!AT194:AT288,1,FALSE)),0,VLOOKUP($K203&N$14,Input!AT194:AU288,2,FALSE))","v":0},{"$f":"IF(ISNA(VLOOKUP($K203&O$14,Input!AT194:AT288,1,FALSE)),0,1)","v":0},0]
[null,null,null,null,null,null,null,null,null,null,190,{"$f":"IF(ISNA(VLOOKUP($K204&L$14,Input!AT195:AT289,1,FALSE)),\"\",VLOOKUP($K204&L$14,Input!AT195:AW289,4,FALSE))","v":""},{"$f":"IF(ISNA(VLOOKUP($K204&M$14,Input!AT195:AT289,1,FALSE)),0,VLOOKUP($K204&M$14,Input!AT195:AU289,2,FALSE))","v":0},{"$f":"IF(ISNA(VLOOKUP($K204&N$14,Input!AT195:AT289,1,FALSE)),0,VLOOKUP($K204&N$14,Input!AT195:AU289,2,FALSE))","v":0},{"$f":"IF(ISNA(VLOOKUP($K204&O$14,Input!AT195:AT289,1,FALSE)),0,1)","v":0},0]

{"sheet":"Logos","index":9,"n_rows":10,"n_cols":4,"rows_kept":10,"cut":false,"hidden":true,"merged":[]}
[]
[]
[]
[null,null,{"$f":"IF(Tables!B4=\"WPS Health Plan\",\"WPSHPlogo\",\"WPSlogo\")","v":"WPSlogo"}]
[]
[null,null,"this switches the logos depending on the company chosen on the Input tab"]
[null,null,"it is used in conjuction with the range name of \"Logo\" on PDFs"]
[null,null,"find \"Logo\" using the Name Manager - WILL BE EITHER C2 OR D2 DEPENDING ON C4"]
[null,null,"THE FORMULA IN C4 CAUSES ALL COMMENTS IN WORKBOOK TO NOT SHOW ON HOVER"]
[null,null,null,"this Forms ComboBox is the fix for all the comments not showing up on hover - there is one appearing on each page that has comments, usually located to the far right of sheet"]